program: Gaussian 09
title: TMA+
version: ES64L-G09RevD.01
method: RB3LYP
basis: 6-31+G(d,p)
operation: Freq
keyword: #P
keyword: Geom=AllCheck
keyword: Guess=TCheck
keyword: SCRF=Check
keyword: GenChk
keyword: RB3LYP/6-31+G(d,p)
keyword: Freq
converged: YES YES NO NO
title: Mulliken charges:
elementType: C N C C C H H H H H H H H H H H H
charge: -0.275325 -0.414717 -0.275629 -0.275200 -0.275512 0.209672 0.209687 0.209573 0.209673 0.209804 0.209645 0.209790 0.209602 0.209757 0.209880 0.209607 0.209693
chargesum: 1.00000
title: Mulliken charges with hydrogens summed into heavy atoms:
elementType: C N C C C
charge: 0.353607 -0.414717 0.353492 0.353950 0.353669
polarizability: 6.55761794e+01 -2.03819540e-02 6.55467371e+01 -4.53412905e-03 -1.48260550e-02 6.55812310e+01
1716.lowfreq: -79.0416 -51.4452 -0.0269 0.0009 0.0015 34.4935 191.0608 271.5271 302.0746
frequency: 188.4583 271.4566 302.0571 315.4213 361.8291 370.0354 452.2522 457.4165 465.3441 751.1146 951.4090 954.8415 958.9020 1081.0334 1089.2522 1091.2341 1186.1787 1195.0357 1309.5024 1310.4872 1315.1821 1443.5279 1448.5895 1450.4052 1468.9458 1472.8772 1475.7620 1480.2779 1480.9043 1494.6610 1505.4474 1511.0361 1515.4282 3085.2397 3086.8661 3090.1825 3097.3208 3185.4212 3186.8731 3187.9846 3189.0056 3190.6515 3192.6843 3196.4362 3201.5772
redmass: 1.0114 1.0387 1.0410 1.0399 2.2759 2.3278 2.3286 2.3379 2.4143 3.9235 2.6125 2.6190 2.6293 1.1959 1.1979 1.1963 1.3109 1.3062 2.1209 2.0840 2.0347 1.1404 1.1361 1.1360 1.0529 1.0451 1.0415 1.0361 1.0359 1.1528 1.0672 1.0869 1.0644 1.0302 1.0303 1.0301 1.0326 1.1088 1.1090 1.1087 1.1094 1.1090 1.1086 1.1086 1.1083
irintensity: 0.0010 0.0112 0.0106 0.0264 0.0043 0.0015 0.0503 0.0427 0.0227 0.0099 35.8914 36.8946 36.8431 0.0045 0.0098 0.0027 0.0242 0.0136 0.1997 0.1519 0.0580 0.3582 1.8785 2.4476 2.9676 0.1256 0.8526 0.3176 0.0723 15.0669 63.4430 54.3478 68.2681 9.5447 10.1766 10.6238 0.9585 1.0251 0.1243 1.3077 0.5937 2.5889 5.9205 4.1215 6.6464
temp: 298.150 k
press: 1.00000 atm
elementType: 6 7 6 6 6 1 1 1 1 1 1 1 1 1 1 1 1
symmnumber: 1
zpe: 430754.6 jmol-1
zpe.correction: 0.164066 hartree
zpe.thermalcorrener: 0.170647 hartree
zpe.thermalcorrenthalpy: 0.171591 hartree
zpe.thermalcorrgfe: 0.135211 hartree
zpe.sumelectzpe: -214.130057 hartree
zpe.sumelectthermal: -214.123476 hartree
zpe.sumelectthermalent: -214.122532 hartree
zpe.sumelectthermalfe: -214.158912 hartree
dipole: -1.6321 -0.9359 0.2831
dipole: 1.9026
quadrupole: -26.1674 -26.5471 -26.6995
quadrupole: 0.3020 -0.0944 -0.0599
quadrupole: 0.3039 -0.0758 -0.2281 0.3020 -0.0944 -0.0599
hfenergy: -214.2941231 hartree
pointgroup: C01 [X(C4H12N1)]
dipole: 0.0002196 0.0013308 -0.0005621 debye
dipolederiv: 0.528817 -0.0008535 -0.0032723 0.0000585 0.087538 0.0020709 0.001215 -0.0012383 0.0850429 -0.4607088 0.0010147 0.0042879 0.0001832 -0.4499138 0.0030986 0.0025301 -0.0024957 -0.456183 0.1437079 -0.1305507 0.0280076 -0.14281 0.4633059 -0.0638565 0.0283521 -0.063931 0.1045015 0.1354271 0.0459397 -0.1292051 0.0504086 0.1365059 -0.1253173 -0.1335619 -0.129216 0.435413 0.135265 0.0897208 0.1064233 0.0939036 0.2375755 0.1939764 0.1110015 0.192569 0.3221439 0.0408619 0.0075935 0.0083864 -0.0365874 0.0574651 -0.0875702 -0.0415674 -0.0870061 0.0274276 0.0396459 -0.009614 0.0025133 0.0516997 -0.0334076 0.0292002 -0.0102389 0.0291799 0.1246318 0.0393057 0.0037841 -0.0073187 -0.0175706 0.1114401 0.0544909 0.052057 0.0542773 -0.0215403 0.0852995 -0.0299567 -0.0785828 0.0112036 0.0200423 -0.022997 -0.0605535 -0.0783351 0.0105698 0.0883015 0.003016 0.0741649 0.0324245 0.0526159 0.0067163 0.0496586 0.06168 -0.0127824 -0.0445203 0.0229782 -0.005599 -0.0383078 0.0484528 0.0146078 0.0058575 0.0149116 0.1302475 0.088612 -0.0644272 -0.0341539 -0.0595465 0.0360591 -0.0695328 0.0023347 -0.0184416 0.0072442 -0.0440189 -0.0076442 0.0224497 0.0154003 0.1221936 0.0277961 -0.0363767 0.0279631 0.0562902 0.0899049 0.0719462 0.0164507 0.0427239 -0.020133 0.0453322 0.0370982 0.0013351 0.060527 0.0900881 -0.0495234 0.0523881 -0.0554087 0.0592069 0.0498287 0.0174289 -0.0001894 -0.0195059 0.0894278 0.0617141 -0.0393301 0.0290465 -0.0261062 -0.0151107 -0.0545424 0.0412209 0.064682 -0.0454162 -0.0151374 -0.0176098 0.0231786 0.0971596 -0.0427336 0.0293072 -0.0422838 0.0812901 unknown
polarizability: 65.5761794|-0.020382|65.5467371|-0.0045341|-0.0148261|65.581231 unknown
InChI: InChI=1/C4H12N/c1-5(2,3)4/h1-4H3
charge 1 multiplicity 1
17 atoms
C  -1.84244447 -0.19428624 0.05893541
N  -0.34039215 -0.19625298 0.05846207
C  0.1623452 -1.589801 0.30565961
C  0.1598692 0.28943935 -1.2723086
C  0.16048707 0.712594 1.14464698
H  -2.19217812 -0.85559381 -0.73360928
H  -2.18727077 0.82443643 -0.11862681
H  -2.18961156 -0.54809548 1.02962254
H  -0.20016069 -2.23880157 -0.49058524
H  -0.21227207 -1.92885548 1.27145718
H  1.25223243 -1.56906671 0.3088851
H  -0.21686996 -0.37636546 -2.04888861
H  1.24984778 0.27824231 -1.25849931
H  -0.2070157 1.30350261 -1.43009232
H  -0.20905895 0.34533719 2.10196749
H  -0.21324592 1.7188576 0.95568933
H  1.25035867 0.70338924 1.12934444
