program: Gaussian 09
title: product1.4
version: ES64L-G09RevD.01
method: RB3LYP
basis: 6-31+G(d,p)
operation: Freq
keyword: #P
keyword: Geom=AllCheck
keyword: Guess=TCheck
keyword: SCRF=Check
keyword: GenChk
keyword: RB3LYP/6-31+G(d,p)
keyword: Freq
converged: YES YES YES YES
title: Mulliken charges:
elementType: C C C O C O C H C H C F F F C C C C C N C C C C C C C C H H H H H H H H H H H H H H
charge: -0.418814 0.355304 0.307589 -0.289631 -0.198827 -0.434576 -0.741407 0.173659 -0.614971 0.165668 1.270941 -0.295829 -0.299904 -0.301162 0.514092 0.008642 -0.081453 0.463287 -0.157517 -0.596238 -0.229402 -0.377134 0.317549 -0.182196 -0.365014 -0.070666 -0.203318 0.166729 0.174227 0.143931 0.170998 0.159723 0.169145 0.135022 0.165442 0.163690 0.156424 0.126007 0.138963 0.142063 0.141704 0.127258
chargesum: 0.00000
title: Mulliken charges with hydrogens summed into heavy atoms:
elementType: C C C O C O C C C F F F C C C C C N C C C C C C C C
charge: -0.100655 0.355304 0.307589 -0.289631 0.301039 -0.434576 -0.567748 -0.449303 1.270941 -0.295829 -0.299904 -0.301162 0.514092 0.143664 0.083989 0.463287 -0.157517 -0.596238 -0.065712 -0.220709 0.317549 -0.056189 -0.226052 0.071397 -0.061614 0.293987
polarizability: 3.45098953e+02 -2.14863692e+01 2.60787795e+02 8.93213188e+00 -1.44442518e+01 2.32181797e+02
1716.lowfreq: -14.9519 -11.4733 -0.0006 0.0004 0.0007 5.2134 11.7479 26.1595 32.1944
frequency: 9.7511 25.7110 32.0770 33.6556 40.2026 46.1890 69.1839 74.3440 96.1416 120.0988 126.9022 144.1251 152.9587 161.4125 168.6997 201.1330 208.1542 247.3521 260.7722 280.6196 297.9016 308.7518 318.9883 364.7494 412.7002 414.7399 438.4666 450.3357 483.3558 500.1895 515.2093 535.8265 545.7601 563.3676 572.2070 588.5741 604.2330 633.6895 655.8239 670.0768 685.4894 705.2071 710.0198 748.4977 771.5075 776.3250 828.0798 835.9431 850.0046 854.4756 858.2438 865.6439 879.8368 902.0378 926.7133 972.3252 982.6630 984.1783 985.2467 994.5155 1002.9932 1007.7532 1019.6262 1041.3338 1053.5435 1058.2943 1095.7589 1112.5251 1134.2428 1148.8600 1176.7030 1178.9878 1180.5895 1206.6051 1207.8363 1209.9617 1219.3894 1223.3929 1233.6169 1245.5276 1258.4129 1289.4001 1318.9161 1339.1684 1342.9928 1363.7260 1383.7171 1390.5240 1398.0927 1440.2833 1456.9627 1483.1385 1487.8527 1490.4890 1492.2027 1532.9069 1548.2173 1613.8049 1636.6720 1652.6422 1662.5343 1699.3465 1759.3605 2334.7669 3068.2939 3090.9864 3117.7571 3150.1445 3178.4893 3179.1383 3181.4265 3187.5346 3195.3636 3200.9821 3201.5356 3210.3606 3214.0154 3223.4095 3227.6033 3268.8173
redmass: 6.1705 6.3887 5.5264 5.3226 7.7905 5.5835 4.9236 4.9053 6.6926 2.8599 4.1090 7.5471 4.2147 3.2158 2.1955 5.8971 5.7212 4.5389 5.7716 7.8144 10.2534 8.9701 3.7673 3.7564 2.8715 2.8680 5.8385 5.8951 8.8395 7.2010 4.7537 7.5616 6.6238 7.7809 3.5884 3.3674 3.3629 6.2429 6.4552 3.0863 5.7410 2.6708 1.5813 4.2685 2.2303 5.7798 2.5614 3.0185 1.3433 1.2883 3.6807 2.5681 3.7596 3.9036 1.4525 1.8761 1.4520 1.4967 1.7418 1.4408 1.3070 2.5729 6.1782 2.9538 3.3340 2.8342 3.9536 1.7771 6.3175 1.4480 2.3528 1.3305 1.0972 1.1637 1.4441 2.4146 1.7729 1.7959 2.6567 4.2961 2.1970 1.9340 2.8287 2.5613 1.7104 2.9890 1.4082 1.7739 1.7082 1.1890 2.4068 1.1007 1.1020 1.1057 2.1111 2.1938 2.4041 6.2636 5.6185 5.6140 5.8077 5.3785 11.0607 12.6812 1.0299 1.0847 1.0837 1.1078 1.0653 1.1054 1.0839 1.0872 1.0913 1.0905 1.0938 1.0985 1.0890 1.0948 1.0957 1.1157
irintensity: 0.0827 0.2735 2.6191 0.5449 0.1086 0.1602 1.2517 0.0193 2.2691 6.1965 4.9548 5.4824 3.4418 1.1643 2.8719 0.6015 1.3223 0.9351 3.7899 0.8793 0.1431 1.1997 7.9492 19.7879 0.0140 0.0232 1.2658 1.9953 6.2730 3.6143 13.5978 4.0189 0.9509 0.6109 11.2049 2.6905 46.6521 1.2494 6.7179 21.7952 20.2524 0.8823 76.2363 2.9210 26.5050 4.1974 22.2557 46.3549 1.8782 1.9435 4.6566 18.1783 3.7062 29.1355 4.3577 3.6348 21.1858 6.0652 10.5531 0.3897 0.2350 8.6623 1.2018 5.0975 0.6849 12.0144 205.2546 7.6286 434.7762 18.8265 84.5184 10.4644 0.5393 0.6723 2.0672 1.2482 17.7354 56.8057 38.0550 258.8820 135.4193 130.2633 135.7485 19.8950 55.6902 0.6815 8.2402 21.4149 17.8707 31.6179 8.3798 19.7287 21.3284 16.2710 5.5682 12.4568 11.7712 0.1442 1.7233 4.1028 22.6913 42.5817 265.0768 127.2444 39.4724 3.6381 5.2800 17.3551 5.5493 14.8863 3.2131 0.4420 12.8816 2.1051 28.3625 12.7460 0.9628 2.2608 0.6956 2.3126
temp: 298.150 k
press: 1.00000 atm
elementType: 6 6 6 8 6 8 6 1 6 1 6 9 9 9 6 6 6 6 6 7 6 6 6 6 6 6 6 6 1 1 1 1 1 1 1 1 1 1 1 1 1 1
symmnumber: 1
zpe: 834520.4 jmol-1
zpe.correction: 0.317852 hartree
zpe.thermalcorrener: 0.341477 hartree
zpe.thermalcorrenthalpy: 0.342421 hartree
zpe.thermalcorrgfe: 0.260804 hartree
zpe.sumelectzpe: -1276.347526 hartree
zpe.sumelectthermal: -1276.323901 hartree
zpe.sumelectthermalent: -1276.322957 hartree
zpe.sumelectthermalfe: -1276.404574 hartree
dipole: 5.1608 -4.6093 -1.6031
dipole: 7.1028
quadrupole: -160.5728 -156.0829 -152.5721
quadrupole: 6.0347 -2.1513 -9.2094
quadrupole: -4.1635 0.3264 3.8371 6.0347 -2.1513 -9.2094
hfenergy: -1276.6653779 hartree
pointgroup: C01 [X(C20H16F3N1O2)]
dipole: 2.0304125 -1.8134325 -0.6307025 debye
polarizability: 345.0989531|-21.4863692|260.7877946|8.9321319|-14.4442518|232.1817967 unknown
InChI: InChI=1/C20H16F3NO2/c1-13(19(25)26-2)17(15-6-4-3-5-7-15)18(20(21,22)23)16-10-8-14(12-24)9-11-16/h3-11,17-18H,1H2,2H3
charge 0 multiplicity 1
42 atoms
C  4.77844422 -0.37326048 0.45315723
C  4.2570143 0.61746357 -0.27963091
C  5.02210208 1.20634605 -1.42236145
O  6.15048611 0.53405354 -1.71214329
C  6.95183133 1.07392632 -2.78220827
O  4.6649389 2.20105374 -2.03219436
C  2.8664858 1.20704188 -0.10913495
H  2.91163542 2.24088407 -0.45579259
C  2.3173979 1.22999827 1.35135516
H  2.37670289 0.22703858 1.78255655
C  3.14011106 2.11643865 2.29142986
F  3.35436539 3.36115422 1.79184238
F  2.5147782 2.27631703 3.48749169
F  4.36088869 1.59979724 2.57472181
C  0.85678746 1.65734884 1.36879121
C  -0.12001951 0.75392471 1.80051924
C  -1.46932834 1.0926579 1.77565435
C  -1.85541393 2.36091992 1.31444623
C  -3.2423504 2.71776882 1.27668428
N  -4.36928602 3.0063671 1.24404882
C  -0.88194207 3.27869358 0.8853912
C  0.46138429 2.92230449 0.91285371
C  1.88289401 0.47242451 -1.02179227
C  1.68579373 -0.90869649 -0.90330801
C  0.74429434 -1.56464491 -1.69723652
C  -0.00698666 -0.8459931 -2.63177608
C  0.19532901 0.52885477 -2.76811283
C  1.13471286 1.18205713 -1.9667241
H  5.76142386 -0.77318719 0.23556322
H  4.25163765 -0.80338127 1.29789944
H  6.37831976 1.10315528 -3.71151738
H  7.79896231 0.39530057 -2.87898176
H  7.2956068 2.08026139 -2.53095428
H  0.17532933 -0.23091229 2.14817763
H  -2.22131899 0.38443338 2.10537862
H  -1.18267855 4.25785864 0.5292842
H  1.20147725 3.63536877 0.56831939
H  2.27639816 -1.48021254 -0.19330788
H  0.60063076 -2.6358672 -1.59010966
H  -0.73901841 -1.35497651 -3.25156171
H  -0.37775937 1.09519777 -3.49619529
H  1.28481964 2.2517056 -2.07413135
