program: Gaussian 09
title: adduct 1 scan
version: ES64L-G09RevD.01
method: RB3LYP
basis: 6-31+G(d,p)
operation: Freq
keyword: #P
keyword: Geom=AllCheck
keyword: Guess=TCheck
keyword: SCRF=Check
keyword: GenChk
keyword: RB3LYP/6-31+G(d,p)
keyword: Freq
converged: YES YES YES YES
title: Mulliken charges:
elementType: F C C C O C O C C C C C C C H H H H H H H H H H H N C C C C N C C H H H H H H H H H H H H
charge: -0.330624 0.477717 -0.224840 0.540235 -0.291725 -0.165284 -0.514840 -0.474832 -0.517542 -0.220565 -0.148734 -0.072457 -0.188209 0.270116 0.163631 0.156975 0.157702 0.139950 0.158437 0.167811 0.139051 0.138962 0.136049 0.134933 0.140450 -0.416380 0.060755 -0.371784 -0.020671 -0.342557 -0.196809 -0.362223 -0.166862 0.170730 0.174103 0.158435 0.157925 0.180614 0.196190 0.157377 0.161375 0.155949 0.162809 0.169376 0.199281
chargesum: 0.00000
title: Mulliken charges with hydrogens summed into heavy atoms:
elementType: F C C C O C O C C C C C C C N C C C C N C C
charge: -0.330624 0.641348 -0.224840 0.540235 -0.291725 0.289343 -0.514840 -0.148583 -0.517542 -0.081514 -0.009772 0.063593 -0.053275 0.410566 -0.416380 0.405587 -0.055425 0.356133 -0.023804 -0.196809 -0.043465 0.201794
polarizability: 2.55985775e+02 -2.97844699e+01 2.59306406e+02 -7.98759791e+00 -2.29574348e+01 2.70542391e+02
1716.lowfreq: -220.3380 -16.7746 -11.7494 -9.2325 -0.0798 0.0003 0.0009 13.3926 30.0997
frequency: -220.3374 11.6607 29.7125 50.4687 52.1354 70.4236 72.3374 77.0871 106.6678 119.2348 146.0757 149.2771 172.2525 197.0408 219.2611 272.6217 292.5403 331.7900 341.5465 360.9966 381.9063 410.3303 416.2445 431.3357 444.3158 476.2259 523.4520 568.2771 582.1804 585.6552 611.6540 620.4343 633.3183 694.7297 716.7522 747.9149 760.5004 775.2432 804.4052 824.0682 824.3548 844.7168 850.9962 855.4210 864.3902 867.6166 908.9036 927.3310 940.5219 959.0306 983.3818 992.9397 999.7178 1002.0927 1007.1106 1017.4493 1037.8688 1042.5233 1049.5934 1053.9994 1072.9390 1079.5935 1102.8032 1112.8358 1165.1828 1178.5873 1179.0739 1198.0892 1198.9836 1206.2535 1208.8296 1209.6329 1213.6815 1220.9159 1265.9419 1287.5725 1312.9020 1331.3407 1334.4801 1341.3514 1346.5918 1349.1942 1355.6356 1358.3868 1361.7461 1363.9193 1371.7011 1376.0182 1380.1595 1404.0855 1412.0792 1478.0636 1479.5848 1482.9741 1489.8907 1492.3009 1496.9042 1500.2631 1505.3082 1508.4203 1514.7900 1525.2306 1530.8615 1631.6453 1654.6894 1700.0395 3052.9256 3062.7191 3065.7542 3066.8820 3070.8826 3085.8452 3095.0456 3107.7762 3112.9041 3113.6459 3114.2726 3126.7596 3127.9561 3131.2985 3150.9617 3153.1758 3159.6455 3179.3113 3185.5442 3195.5838 3206.4446 3220.5778 3227.6226
redmass: 7.9915 3.7140 4.4215 3.7254 3.8739 5.3678 2.8598 2.3904 5.6385 2.0155 4.1867 3.9784 1.7167 4.6089 6.1755 5.6959 4.4176 2.1528 1.9793 3.1714 2.7825 5.0186 2.9378 2.3716 2.6899 3.3353 9.5790 3.9459 3.6723 3.6331 8.4192 6.6964 6.3961 4.2710 1.8431 3.5358 2.1069 7.1798 4.6389 1.2840 4.1253 1.2883 1.3469 3.9278 3.8102 1.2527 2.4911 2.9809 1.7439 2.2166 3.3039 1.3649 4.2399 4.0492 1.2841 5.9898 1.5914 2.6684 2.8034 2.1149 2.9138 3.1004 1.6530 2.1591 1.7617 1.2696 1.0934 1.1534 1.3557 1.1625 1.4896 1.8661 1.8126 1.4601 1.0956 2.1512 1.4765 1.2492 1.2316 1.2659 1.3351 1.3045 1.4168 1.4038 3.9143 1.4761 1.4251 1.3232 1.9912 1.8806 1.6196 1.2215 2.1049 1.0461 1.0812 1.0806 1.0742 1.0879 1.0974 1.0929 1.6879 1.1539 2.2799 5.7666 5.7161 11.2991 1.0296 1.0587 1.0593 1.0594 1.0605 1.0638 1.0598 1.1084 1.0850 1.1078 1.1077 1.1067 1.1087 1.0599 1.1058 1.1084 1.1052 1.0857 1.0888 1.0931 1.0974 1.1137 1.0922
irintensity: 393.5824 0.1706 0.5058 0.1569 0.1153 3.4964 0.1887 0.2035 4.2810 13.2500 7.0548 5.3174 7.5596 4.1686 8.4859 7.1680 48.6630 12.5628 3.1233 18.5282 9.2395 42.2528 0.4405 0.5895 13.8302 20.7276 90.3192 26.5023 0.8985 0.7884 22.3466 19.4723 0.8176 5.3414 55.2296 114.8009 146.8814 24.7129 15.4567 16.4435 110.6690 10.9161 20.8978 56.8803 60.5794 0.6204 33.6004 3.1794 9.3230 40.0046 17.6726 0.4556 18.3356 47.9863 0.7141 0.0723 0.1642 0.1831 1.5869 4.9415 26.2521 38.4536 4.8302 50.6584 410.1443 3.0365 0.2825 1.3538 64.9746 8.3300 14.1076 2.2298 6.9203 60.1915 0.9130 150.3625 16.0375 1.6476 1.0386 3.7280 6.4052 1.2270 12.6164 1.0873 2.6974 32.4931 39.1250 17.0077 99.2680 114.9174 75.9234 54.6597 5.3799 8.2737 1.3739 2.4678 5.5588 15.2222 18.4574 13.1758 84.8023 4.0807 12.3856 0.2880 10.5978 787.5366 76.4423 9.9020 53.0141 68.2281 69.7791 29.2555 7.8195 0.7519 13.5133 7.5153 29.1029 30.7570 43.7696 25.9923 24.1715 12.9917 9.1277 2.5633 6.0264 26.7862 24.1894 7.0945 5.6339
temp: 298.150 k
press: 1.00000 atm
elementType: 9 6 6 6 8 6 8 6 6 6 6 6 6 6 1 1 1 1 1 1 1 1 1 1 1 7 6 6 6 6 7 6 6 1 1 1 1 1 1 1 1 1 1 1 1
symmnumber: 1
zpe: 1007357.6 jmol-1
zpe.correction: 0.383682 hartree
zpe.thermalcorrener: 0.403682 hartree
zpe.thermalcorrenthalpy: 0.404626 hartree
zpe.thermalcorrgfe: 0.332554 hartree
zpe.sumelectzpe: -1021.189562 hartree
zpe.sumelectthermal: -1021.169562 hartree
zpe.sumelectthermalent: -1021.168618 hartree
zpe.sumelectthermalfe: -1021.240690 hartree
dipole: -1.0030 7.0894 4.3105
dipole: 8.3574
quadrupole: -127.3853 -139.7401 -106.1132
quadrupole: -11.7834 -7.3807 7.2186
quadrupole: -2.9724 -15.3273 18.2997 -11.7834 -7.3807 7.2186
hfenergy: -1021.573244 hartree
pointgroup: C01 [X(C17H23F1N2O2)]
dipole: -0.394625 2.7891788 1.6958762 debye
polarizability: 255.985775|-29.7844699|259.3064056|-7.9875979|-22.9574348|270.5423908 unknown
InChI: InChI=1/C11H11FO2.C6H12N2/c1-8(11(13)14-2)10(12)9-6-4-3-5-7-9;1-2-8-5-3-7(1)4-6-8/h3-7,10H,1H2,2H3;1-6H2
charge 0 multiplicity 1
45 atoms
F  -3.1053399 -1.41395695 0.66408181
C  -1.67756156 -1.10291544 0.49385062
C  -1.05298012 -0.79538828 1.80289857
C  -0.52516582 -1.92212572 2.53535142
O  -0.0298092 -1.58355444 3.77782783
C  0.56855273 -2.65420326 4.51738934
O  -0.47099504 -3.08803761 2.14108474
C  -1.04518294 0.50128095 2.34353496
C  -1.57422388 -0.01473275 -0.55341455
C  -0.29841986 0.4058176 -0.95966898
C  -0.14954624 1.40278535 -1.92344559
C  -1.27736276 1.99973278 -2.49759387
C  -2.5489443 1.58202819 -2.10281623
C  -2.69733784 0.57785889 -1.13928313
H  -1.27453008 -2.04201599 0.10924577
H  1.42663788 -3.07227053 3.98287455
H  -0.1538416 -3.45313361 4.70830281
H  0.89652589 -2.21247952 5.46045437
H  -1.14990941 1.33427993 1.65237911
H  -0.35672652 0.6904518 3.16066139
H  0.57916217 -0.04997197 -0.51029478
H  0.84616849 1.71351242 -2.22682736
H  -1.16362557 2.7767261 -3.24782346
H  -3.4321195 2.03257903 -2.54714397
H  -3.68690406 0.24870947 -0.84607296
N  -2.59921428 0.95629409 3.34167486
C  -2.30426963 2.12217271 4.20625759
C  -3.57616633 2.45233352 5.05054823
C  -2.99857277 -0.19828407 4.18233141
C  -4.3045022 0.17125406 4.94773682
N  -4.68932767 1.56695206 4.67929997
C  -4.95482531 1.71199413 3.23985372
C  -3.70354331 1.29680113 2.4082113
H  -2.01296916 2.95233717 3.55627111
H  -1.45051764 1.86404924 4.83874921
H  -3.88740569 3.48871067 4.89187023
H  -3.37501558 2.32169236 6.11763806
H  -2.16721999 -0.4139534 4.85552465
H  -3.12724488 -1.05560899 3.51873037
H  -4.16662078 0.04968982 6.02600644
H  -5.13172002 -0.47454155 4.64037027
H  -5.22590756 2.75345002 3.04355609
H  -5.81387737 1.08663029 2.98149591
H  -3.35401228 2.10533999 1.76115787
H  -3.88435454 0.41673033 1.79074749
