program: Gaussian 16
title: NiOPOMe2Ph_PAdDPi2_07_opt_re_56ts_21irc_smcrcfc
version: ES64L-G16RevC.01
method: RwB97XD
basis: def2SVP
operation: Freq
keyword: #P
keyword: Geom=AllCheck
keyword: Guess=TCheck
keyword: SCRF=Check
keyword: GenChk
keyword: RwB97XD/def2SVP
keyword: Freq
converged: YES YES YES YES
title: Mulliken charges:
elementType: C C C C H H C C C C H C C H H H P C C C C H C C H H H C C C C C H C H H H P C H H H C H H H O C H H C O C H H H O C H H H Ni C C C C H C H C H H H O P O O C H H H C H H H C H H H C H H H
charge: -0.204837 -0.237820 0.194821 0.082793 0.033025 0.058965 -0.094607 -0.043218 -0.172266 -0.000642 0.042158 -0.008917 0.002612 0.029958 0.037431 0.033074 0.411555 -0.136342 -0.034413 -0.089111 -0.013387 0.032847 -0.052915 0.001491 0.020657 0.011156 0.023455 -0.207227 -0.108071 -0.007371 -0.045839 -0.015378 0.021327 0.002849 0.014353 0.020833 0.026530 0.375535 0.084515 0.046333 0.044276 0.050298 0.095731 0.047399 0.054685 0.035904 -0.370825 0.177347 0.036716 0.034858 0.086163 -0.386828 0.062585 0.052954 0.045138 0.033344 -0.359594 0.067199 0.043977 0.039034 0.043241 0.175637 -0.174203 -0.038540 -0.014932 -0.026660 0.021918 -0.021400 0.013693 -0.029520 0.004898 0.010062 0.008378 -0.655030 0.823442 -0.531553 -0.547861 0.164898 0.018322 0.013316 0.021926 0.147323 0.022995 0.023978 0.024792 0.044442 0.036804 0.023824 0.119833 0.061397 0.078439 0.075483 0.034384
chargesum: -0.00000
title: Mulliken charges with hydrogens summed into heavy atoms:
elementType: C C C C C C C C C C P C C C C C C C C C C C C P C C O C C O C O C Ni C C C C C C O P O O C C C C
charge: -0.204837 -0.237820 0.286810 0.082793 -0.094607 -0.001060 -0.172266 0.029316 0.028513 0.035686 0.411555 -0.136342 -0.001566 -0.089111 0.007270 -0.041759 0.024946 -0.207227 -0.108071 0.013955 -0.031486 0.005455 0.029379 0.375535 0.225421 0.233720 -0.370825 0.248921 0.086163 -0.386828 0.194021 -0.359594 0.193451 0.175637 -0.174203 -0.016622 -0.001240 -0.021761 -0.011338 -0.021141 -0.655030 0.823442 -0.531553 -0.547861 0.218462 0.219088 0.224903 0.249703
polarizability: 5.39934007e+02 -2.63669435e+01 4.83039747e+02 -7.07896906e+00 -3.13575924e+01 4.73041563e+02
1716.lowfreq: -5.4216 -0.0021 0.0028 0.0048 1.7896 2.5347 20.6560 26.8732 33.8591
redmass: 5.5724 4.8571 4.9814 4.1255 3.9910 4.6249 4.7817 4.3039 4.4895 3.9887 3.9774 2.5289 4.8952 4.3503 1.6004 3.1758 4.6622 3.3621 2.0172 1.6341 5.3536 5.0818 5.2517 4.3746 1.0830 3.1046 2.1799 3.9753 4.2300 3.0394 2.5825 4.3162 4.9724 1.0505 1.1008 1.0663 2.6932 3.3493 4.2326 2.7700 2.3409 4.6814 3.1513 3.6718 2.8485 2.4776 1.8694 2.5087 3.0511 3.0739 3.2383 6.2312 6.3269 12.7956 4.2770 4.0481 4.6864 5.0645 2.8152 3.6233 4.6008 4.3346 4.2194 6.0832 3.6978 4.2542 3.7979 4.8939 3.5396 3.9924 3.7314 3.6499 3.9968 2.8150 4.2904 4.1941 4.2258 4.8914 4.3471 5.0127 6.2727 4.3943 9.2758 4.6517 6.3918 3.8488 3.5738 6.2970 5.9393 7.4058 5.7741 5.8988 4.5526 1.6473 3.4572 6.6666 4.5245 2.7045 2.0777 3.6153 1.3298 1.4773 1.2444 4.6396 4.5474 3.3095 4.1267 1.3437 2.0782 2.3862 1.2923 1.2921 1.6367 1.3614 2.3895 1.3179 2.1748 1.7551 7.9121 1.6339 1.3760 1.3797 2.7354 1.5162 2.0348 3.7983 1.4970 1.5080 2.2204 1.3758 1.3705 1.3357 1.3561 1.6303 1.4893 2.9117 2.5628 1.6990 1.8389 2.6168 3.2325 2.7164 2.5076 1.4732 1.5581 2.7781 2.4796 8.1375 3.2057 2.3792 4.9151 4.8207 1.6271 1.8322 1.6438 1.9931 1.1288 2.0679 1.0943 1.0986 1.2899 1.2925 1.1260 1.3878 1.1287 1.4981 2.9118 2.2119 2.0735 2.2570 2.2712 1.7096 2.7060 3.5644 1.5289 1.7667 1.5785 1.4146 1.9384 2.0172 5.9993 7.3187 6.8497 2.6055 1.5976 1.5459 1.2587 1.3466 1.2775 1.4416 1.9819 1.6324 1.3649 1.1504 1.0816 1.0802 1.1498 1.0744 1.1368 1.1220 1.1256 1.6017 1.0810 1.0964 1.0994 1.0851 1.0502 2.1210 1.0784 1.0981 1.0865 1.3942 2.0368 1.0792 1.1053 1.3198 2.4145 2.2188 2.7535 2.6956 6.3638 5.8561 6.3514 6.3042 5.9748 6.0344 6.3437 6.3493 1.0340 1.0312 1.0393 1.0418 1.0366 1.0363 1.0366 1.1058 1.0360 1.0634 1.0702 1.1053 1.1033 1.1067 1.1017 1.0981 1.1037 1.1045 1.1048 1.1046 1.1042 1.1047 1.0854 1.1054 1.1055 1.0881 1.1058 1.1059 1.0941 1.1041 1.0878 1.0877 1.0966 1.0886 1.0904 1.0914 1.0923 1.0983 1.0994 1.0946 1.0962 1.0990 1.1002 1.0975 1.0947
irintensity: 0.0434 0.0132 0.1427 0.1529 0.1833 0.0368 0.1495 0.1710 0.2036 0.5566 0.3738 0.5238 0.3004 1.6999 0.2580 1.2604 1.8898 0.3151 0.1515 1.3738 0.5478 1.7362 2.2985 3.0822 0.2543 0.1602 0.2179 1.0588 1.0004 0.4364 2.0073 3.4112 1.4814 0.1189 0.1272 0.0296 1.8760 4.0064 0.1928 1.8049 0.1427 1.1539 1.2757 4.4790 1.8841 1.4637 5.8138 3.0371 0.7536 2.8531 5.1060 27.0501 8.3347 5.4482 2.6319 1.4382 1.6548 3.9953 0.0670 4.1177 2.9951 2.2155 4.4412 2.1607 0.1914 6.0635 6.5615 5.5741 3.8862 34.8542 22.5164 3.7390 15.9287 3.7139 13.2365 5.9047 8.6742 15.4844 4.9172 14.4080 27.5201 15.9287 21.7856 32.2888 0.3697 3.3720 7.9060 4.9374 26.5379 98.3541 3.2334 3.5693 14.9949 33.5147 23.7779 117.5321 2.9762 52.6304 44.3125 4.8854 22.6362 12.4217 20.6911 4.2667 8.8130 7.5513 5.4742 0.6240 2.3550 16.7066 0.1139 0.3723 1.4921 8.9566 26.6271 1.1116 11.5482 49.2418 464.2755 9.6801 1.2684 4.3405 18.4336 6.3449 44.6800 11.0011 0.5579 3.2983 39.3326 0.0262 1.9779 0.0895 1.0183 9.6325 1.1267 4.6110 3.7848 9.6352 0.6087 1.4896 0.1016 0.9894 3.4009 1.4063 2.0131 4.2936 4.7419 205.5993 1.6224 61.3707 110.2182 65.2942 20.7839 18.0684 20.2737 29.2925 6.1618 68.9181 3.2076 1.8124 0.5651 4.3715 2.3154 8.9609 0.9584 32.6176 6.0512 101.4661 34.1114 9.8810 5.8995 18.6340 29.0414 201.1854 19.6585 17.9823 10.6449 7.6856 2.0107 2.2900 0.0903 0.3654 0.2193 0.3713 8.1877 2.7863 1.4672 36.8726 0.2856 12.8415 75.6690 60.1613 19.8654 18.4449 5.8780 0.3302 4.9428 1.6095 0.3092 6.3270 0.7871 1.6435 3.7943 2.0568 6.3245 2.4267 1.6996 11.4921 3.9704 5.2427 6.8586 8.6677 14.0749 11.5476 17.0198 8.5634 14.4008 19.8699 20.3341 15.7487 0.1381 1.4410 2.0324 3.0017 30.6633 0.2588 7.7324 7.8564 99.1524 42.2004 21.9827 5.5273 10.1085 7.8528 6.8238 41.3938 9.6865 14.5355 18.7223 33.1575 14.5643 39.4608 22.0747 13.8111 19.5443 3.4120 7.8333 11.2231 4.1692 1.3009 3.8888 5.9292 9.6784 0.0731 4.5897 4.2713 0.3795 1.8661 1.6704 1.4729 28.1763 0.2623 5.4188 6.2655 3.5021 25.7934 17.9450 5.5736 8.6237 10.1502 16.2841 11.4579 15.0738
temp: 298.150 k
press: 1.00000 atm
elementType: 6 6 6 6 1 1 6 6 6 6 1 6 6 1 1 1 15 6 6 6 6 1 6 6 1 1 1 6 6 6 6 6 1 6 1 1 1 15 6 1 1 1 6 1 1 1 8 6 1 1 6 8 6 1 1 1 8 6 1 1 1 28 6 6 6 6 1 6 1 6 1 1 1 8 15 8 8 6 1 1 1 6 1 1 1 6 1 1 1 6 1 1 1
symmnumber: 1
zpe: 2004671.9 jmol-1
zpe.correction: 0.763539 hartree
zpe.thermalcorrener: 0.811306 hartree
zpe.thermalcorrenthalpy: 0.812250 hartree
zpe.thermalcorrgfe: 0.684565 hartree
zpe.sumelectzpe: -4455.798810 hartree
zpe.sumelectthermal: -4455.751044 hartree
zpe.sumelectthermalent: -4455.750099 hartree
zpe.sumelectthermalfe: -4455.877785 hartree
dipole: 0.1588 8.1094 -3.0140
dipole: 8.6528
quadrupole: -297.9558 -311.8201 -293.7630
quadrupole: -8.3816 6.2041 4.3099
quadrupole: 3.2238 -10.6404 7.4166 -8.3816 6.2041 4.3099
hfenergy: -4456.5623496 hartree
pointgroup: C01 [X(C38H45Ni1O6P3)]
dipole: 0.062474 3.1904805 -1.1858085 debye
polarizability: 539.9340067|-26.3669435|483.039747|-7.0789691|-31.3575924|473.0415628 unknown
InChI: InChI=1/38C.Ni.6O.3P.45H
charge 0 multiplicity 1
93 atoms
C  1.89823498 0.56996829 -2.26361156
C  3.13583929 1.09116672 0.13906344
C  3.97745274 -0.14345258 -0.17653347
C  4.08847811 -0.3152028 -1.69143612
H  4.9889272 0.03153058 0.22056522
H  3.56835414 -1.04465251 0.28889038
C  0.50747335 2.40826014 -0.27944209
C  1.14349402 3.65792115 -0.21849123
C  -0.88750994 2.35423494 -0.09469991
C  0.40936197 4.81409408 0.03522292
H  2.22434133 3.71658344 -0.34074074
C  -1.61438686 3.51781523 0.17235302
C  -0.96831773 4.74838909 0.23703948
H  0.92556401 5.77485064 0.0915723
H  -2.69238493 3.45152208 0.34013268
H  -1.53815104 5.65466631 0.45231899
P  -1.65993748 0.69738023 -0.18018009
C  -3.06088048 0.77679997 0.98760065
C  -4.3756431 0.76593126 0.50808214
C  -2.81061538 0.81907322 2.37699512
C  -5.45722751 0.79707837 1.38435015
H  -4.56096426 0.72716 -0.56710317
C  -3.91511758 0.86588389 3.23438099
C  -5.22228487 0.84962486 2.75466055
H  -6.47648465 0.78115627 0.99372611
H  -3.73926043 0.8994682 4.31251225
H  -6.0587482 0.87542968 3.4565445
C  -2.41756422 0.64823883 -1.85384888
C  -2.83046497 -0.58836297 -2.39708725
C  -2.54714242 1.81882528 -2.61340414
C  -3.35997654 -0.59266419 -3.69371884
C  -3.07011079 1.78761789 -3.90278925
H  -2.22565431 2.77578725 -2.20052038
C  -3.47735523 0.57244433 -4.44564206
H  -3.68468577 -1.54422282 -4.1220946
H  -3.15913612 2.71192808 -4.4770159
H  -3.89002711 0.52946485 -5.45597409
P  1.36813216 0.77436397 -0.45751065
C  3.16237295 1.44993624 1.61157166
H  4.19846187 1.66481252 1.91207096
H  2.54719131 2.33542133 1.82503595
H  2.78820159 0.60292637 2.2027944
C  0.73728923 0.17462341 -3.15119814
H  1.11637199 -0.04811892 -4.15952806
H  0.23654408 -0.72164929 -2.7583548
H  -0.00159959 0.98486126 -3.21909671
O  2.81406285 -0.5149899 -2.2815797
C  2.60559987 1.83658308 -2.73852848
H  2.84567099 1.72418295 -3.80700734
H  1.96218937 2.7193545 -2.62119256
C  3.92447185 2.00540052 -1.97489875
O  3.6922512 2.1888389 -0.58586908
C  4.72965479 3.19934779 -2.43165281
H  5.65619303 3.25066199 -1.84525221
H  4.98133117 3.09459077 -3.49497382
H  4.15508688 4.12375647 -2.28301742
O  4.69308654 0.85338767 -2.20879082
C  4.93720961 -1.49567643 -2.09397784
H  4.97946505 -1.55155868 -3.18960214
H  5.95371721 -1.37603894 -1.69713317
H  4.49437695 -2.41656758 -1.6933964
Ni 0.0077076 -0.73960363 0.32781383
C  1.40096415 -1.94899012 0.75663026
C  1.92451169 -2.03389116 2.05409434
C  1.85440214 -2.87476706 -0.19295399
C  2.89451936 -2.98270943 2.38406365
H  1.55232159 -1.36526532 2.83561051
C  2.81372965 -3.83457961 0.13376337
H  1.47181687 -2.84089809 -1.21668666
C  3.34705481 -3.88545887 1.42200738
H  3.29086193 -3.0245352 3.40226006
H  3.14700417 -4.54993713 -0.62331068
H  4.1019952 -4.6326432 1.67767287
O  -1.28817391 -1.85471022 1.06466822
P  -1.20688113 -3.24657817 1.82531878
O  -2.82041566 -3.59292567 2.02093018
O  -0.87769765 -2.61662428 3.36978682
C  -3.74020167 -2.62069009 2.45569122
H  -3.3757221 -2.09211834 3.35222624
H  -3.94092167 -1.86639657 1.67668301
H  -4.6823587 -3.13198927 2.70304812
C  -0.50759848 -3.52337472 4.3707968
H  -1.36179419 -4.13758178 4.71086849
H  0.29278388 -4.20815745 4.03246288
H  -0.13017407 -2.95347956 5.2337448
C  -1.42835759 0.7617089 2.96875538
H  -0.70083488 1.36985937 2.41091731
H  -1.43710293 1.1246724 4.00567933
H  -1.07998146 -0.28494885 2.97275901
C  -2.69744681 -1.88869337 -1.65375701
H  -1.66072573 -2.26098152 -1.69791863
H  -2.9237718 -1.80782908 -0.58220906
H  -3.34668577 -2.65669419 -2.09494804
