program: Gaussian 09
title: 000075744
version: EM64L-G09RevD.01
frameworkgroup: C1[X(C4H8N2O2)]
method: RPBEPBE
basis: SDD
operation: Freq
keyword: #pfreq=noraman
keyword: PBEPBE/SDD
title: #p freq=noraman PBEPBE/SDD
converged: YES YES NO NO
title: Mulliken charges:
elementType: O O N N C C C C H H H H H H H H
charge: -0.430051 -0.430051 -0.039419 -0.039421 -0.422808 -0.422809 -0.166846 -0.166843 0.212049 0.245064 0.212054 0.245067 0.234484 0.234484 0.367524 0.367524
chargesum: 0.00000
title: Mulliken charges with hydrogens summed into heavy atoms:
elementType: O O N N C C C C
charge: -0.062528 -0.062527 -0.039419 -0.039421 0.034305 0.034313 0.067637 0.067641
polarizability: 1.14873662e+02 -3.76127919e-03 5.51338170e+01 4.36176048e+00 4.96705298e-03 4.38382042e+01
1716.lowfreq: -36.0046 -6.4857 -6.1110 -0.0006 -0.0005 -0.0003 43.9275 69.8759 78.4666
frequency: 43.9251 68.8655 78.4656 141.6515 190.5723 283.4573 317.3737 328.1952 391.4519 418.8003 423.2216 531.6134 577.2334 765.9501 842.0342 872.6973 913.1333 918.9650 980.6601 1019.6854 1069.5227 1117.6194 1180.3807 1211.1454 1219.7032 1253.5936 1268.8293 1318.7481 1367.2564 1369.5657 1451.9879 1463.3053 1608.2852 1611.3224 2972.5382 2975.7480 3047.4601 3049.5202 3063.0340 3080.7592 3567.8511 3568.1714
redmass: 4.9967 3.9327 2.8567 3.5445 7.1522 2.9276 3.6351 5.5793 3.1084 1.0995 1.1944 4.3049 2.9605 1.3111 3.5854 6.9478 1.4569 1.6027 2.2368 3.9630 1.8250 2.5749 1.3768 1.1435 1.1720 1.2520 1.1266 1.3281 1.4757 1.5481 1.0877 1.1012 6.4234 6.4078 1.0636 1.0666 1.0895 1.0902 1.0926 1.0987 1.0675 1.0675
irintensity: 0.1616 0.0340 0.0231 0.4400 0.2302 3.4731 0.9092 1.2668 17.4933 98.9075 244.1274 56.9751 0.0000 2.6923 144.4430 20.5941 7.1185 58.2024 144.9657 6.8384 0.0173 23.2031 2.8728 69.0171 0.7194 31.8965 0.6758 1.4811 37.4427 0.0018 0.1409 22.6250 0.0169 0.1939 10.4050 35.1070 6.8672 10.2289 11.9410 30.7082 84.6458 12.8923
temp: 298.150 k
press: 1.00000 atm
elementType: 8 8 7 7 6 6 6 6 1 1 1 1 1 1 1 1
symmnumber: 1
zpe: 322658.6 jmol-1
zpe.correction: 0.122894 hartree
zpe.thermalcorrener: 0.132442 hartree
zpe.thermalcorrenthalpy: 0.133386 hartree
zpe.thermalcorrgfe: 0.087422 hartree
zpe.sumelectzpe: -416.414822 hartree
zpe.sumelectthermal: -416.405274 hartree
zpe.sumelectthermalent: -416.404330 hartree
zpe.sumelectthermalfe: -416.450295 hartree
dipole: -0.0001 0.3983 0.0005
dipole: 0.3983
quadrupole: -44.8335 -44.4031 -49.2726
quadrupole: 0.0000 -1.5362 0.0022
quadrupole: 1.3363 1.7666 -3.1029 0.0000 -1.5362 0.0022
hfenergy: -416.5377164 hartree
pointgroup: C01 [X(C4H8N2O2)]
dipole: -0.0000503 0.1567137 0.0002174 debye
dipolederiv: -1.2981957 0.1471294 -0.128273 -0.2537013 -0.108817 0.0996939 -0.5099218 0.2438273 -0.3795242 -1.2982683 -0.1469509 -0.1284044 0.2544097 -0.1084356 -0.0993918 -0.5095019 -0.2434785 -0.3798551 0.7628727 -0.2546157 0.142882 0.1183323 -0.1865696 0.0256295 0.4471312 -0.0939748 -0.122285 0.7629819 0.2543875 0.1430839 -0.1190023 -0.1866757 -0.0257285 0.4467883 0.0938355 -0.1222808 -0.0686977 -0.0073374 -0.0284156 0.0851957 0.1246676 -0.0433143 -0.0902688 -0.0682763 0.0817371 -0.0686579 0.0073749 -0.0284186 -0.085123 0.1245004 0.0433832 -0.0905193 0.0683171 0.0818762 0.1709995 0.0045036 0.0873284 0.1016914 0.0769359 0.1497203 0.2876237 0.1133425 0.0020901 0.1709628 -0.0046129 0.0873541 -0.1020264 0.0773181 -0.1495921 0.2876112 -0.1131941 0.0017532 0.0030791 0.0640725 -0.0366039 0.0173721 -0.050548 0.131159 -0.042067 0.0985754 0.0065479 0.0646842 -0.0030649 0.0101618 -0.0358049 -0.025857 -0.1058381 0.0022271 -0.0729042 0.0178209 0.0030673 -0.0640202 -0.0366748 -0.0173006 -0.0502265 -0.131235 -0.0420799 -0.0986546 0.0062338 0.0646746 0.0030611 0.0101607 0.0358111 -0.0261001 0.1057706 0.0022763 0.0728476 0.0180727 0.0258428 0.0028588 -0.050573 0.010218 -0.0116129 -0.1317997 -0.0745898 -0.1354112 0.0788802 0.0258377 -0.0027838 -0.0505743 -0.0101164 -0.0119607 0.1316899 -0.0746021 0.1352842 0.079231 0.3394192 0.0468459 0.0035023 0.0096922 0.1818252 -0.1272758 -0.0200678 -0.1209296 0.314706 0.339398 -0.0468478 0.0034643 -0.0096473 0.181556 0.1271288 -0.0200394 0.1207937 0.3149961 unknown
polarizability: 114.8012424|-0.0036282|55.1338165|4.9156984|0.0055205|43.9106246 unknown
InChI: InChI=1S/C4H8N2O2/c7-5-3-1-2-4-6-8/h3-4,7-8H,1-2H2
charge 0 multiplicity 1
16 atoms
O  4.085479 -0.230783 0.305795
O  -4.085513 -0.230416 -0.305867
N  2.785871 -0.495923 -0.335837
N  -2.785825 -0.496463 0.335227
C  0.529856 0.389245 -0.571909
C  -0.529793 0.388404 0.572304
C  1.934678 0.449251 -0.026404
C  -1.934625 0.449065 0.026895
H  0.355503 1.269808 -1.224358
H  0.414269 -0.513616 -1.196509
H  -0.355504 1.268067 1.225988
H  -0.414128 -0.515317 1.195643
H  2.21739 1.290345 0.630735
H  -2.217379 1.291007 -0.62914
H  4.631461 -1.001682 0.003757
H  -4.63154 -1.001592 -0.004619
