program: Gaussian 16
title: [Ni(Ph)(NMe2)(PAd-DalPhos)] Ph trans to PCg - irc rev
version: ES64L-G16RevC.01
method: RwB97XD
basis: def2SVP
operation: Freq
keyword: #P
keyword: Geom=AllCheck
keyword: Guess=TCheck
keyword: SCRF=Check
keyword: GenChk
keyword: RwB97XD/def2SVP
keyword: Freq
converged: YES YES YES YES
title: Mulliken charges:
elementType: C C C C H H C C C C H C C H H H P C C C C H C H C H H H C C C C H C H C H H H P C H H H C H H H O C H H C O C H H H O C H H H Ni C C C C H C H C H H H N C H H H C H H H
charge: -0.202623 -0.231496 0.189910 0.084998 0.028099 0.003059 -0.116648 -0.039439 -0.130284 -0.005338 0.028532 -0.031529 -0.000958 0.020326 0.019229 0.021124 0.385560 -0.179773 -0.027700 -0.011332 -0.017533 0.030694 -0.017887 0.029815 -0.020696 0.020771 0.019807 0.021388 -0.130493 0.010127 -0.029106 -0.009740 0.020783 -0.013608 0.010826 -0.015025 0.016595 0.017445 0.021823 0.305928 0.078153 0.037138 0.044126 0.044214 0.082519 0.045861 0.041354 0.031534 -0.374344 0.184077 0.026351 0.029122 0.088885 -0.382450 0.063333 0.040515 0.032715 0.047075 -0.366279 0.058423 0.048140 0.038346 0.036729 0.031876 -0.051112 -0.034974 0.002128 0.011073 -0.001440 -0.044703 -0.006199 -0.046133 0.020086 0.006108 0.003931 -0.382395 0.093459 0.042833 0.028211 0.048620 0.100081 0.043250 0.060237 0.023894
chargesum: -0.00000
title: Mulliken charges with hydrogens summed into heavy atoms:
elementType: C C C C C C C C C C P C C C C C C C C C C C C P C C O C C O C O C Ni C C C C C C N C C
charge: -0.202623 -0.231496 0.221069 0.084998 -0.116648 -0.010907 -0.130284 0.014988 -0.012300 0.020166 0.385560 -0.179773 0.002994 0.018483 0.003238 0.001920 0.000691 -0.130493 0.030910 -0.018280 0.006855 0.003837 0.006798 0.305928 0.203632 0.201268 -0.374344 0.239549 0.088885 -0.382450 0.183638 -0.366279 0.181638 0.031876 -0.051112 -0.036413 -0.004071 0.031159 -0.038595 -0.042201 -0.382395 0.213123 0.227462
chargesum: 0.00000
polarizability: 5.11931180e+02 -1.54667203e-01 4.50965825e+02 -1.44789430e+01 -3.54600035e+01 4.37580095e+02
1716.lowfreq: -4.2321 -0.0052 -0.0033 0.0026 2.1929 4.3092 12.3254 34.2626 37.6522
frequency: 12.2182 34.2414 37.6508 42.6531 46.8601 50.1801 59.9853 65.7386 66.7523 74.8644 78.4049 94.3306 109.8921 114.9017 135.2060 136.6886 148.9088 156.6573 166.8666 174.4718 192.6415 205.7866 213.9523 220.2980 222.7067 223.3294 232.3240 235.5252 236.8297 244.7721 247.5984 252.4960 265.2527 267.0705 271.9890 279.6341 280.4354 285.2774 293.7101 298.4652 321.5341 341.7022 348.5765 361.7441 369.2139 396.1700 405.5586 408.2131 414.1385 424.6818 426.8056 435.7401 448.8167 450.0827 466.1706 474.2540 474.5402 480.7017 491.8040 497.9616 510.3967 520.4298 527.6584 530.6755 541.7636 546.7673 557.6752 570.5835 594.0685 609.8520 622.2513 635.1960 636.4650 651.7090 681.3043 693.0296 698.8253 711.4989 716.0834 721.5184 728.1344 730.2491 740.4676 741.9299 755.2778 772.2958 776.8990 781.2110 787.1834 792.2745 830.6706 859.8031 866.3353 874.0721 880.3772 881.2848 883.0079 917.2531 920.5701 931.8783 953.3613 954.4674 962.9646 968.9591 976.7266 977.4885 982.1684 992.9272 997.6914 1006.3778 1008.0390 1016.0656 1017.8710 1018.2726 1018.5864 1021.6925 1025.8636 1037.9441 1046.2250 1046.9261 1047.8231 1054.7166 1059.1590 1060.4281 1062.2664 1074.4781 1076.1191 1098.6483 1104.9882 1108.1110 1112.7497 1121.0819 1133.7228 1134.8507 1135.8404 1143.5179 1156.1209 1161.1641 1163.1281 1170.6634 1175.1445 1175.8475 1178.0737 1182.2224 1184.2369 1184.9289 1200.5944 1202.5838 1209.3519 1218.6079 1225.9099 1235.2140 1255.4578 1256.3453 1257.6569 1278.2359 1284.7008 1303.6771 1311.2865 1320.9812 1329.6866 1337.6740 1343.8091 1362.9448 1365.6823 1368.1417 1374.3851 1382.8756 1399.4417 1399.6644 1403.8615 1417.6322 1432.0412 1434.1700 1442.4297 1455.8748 1457.8811 1459.5524 1460.3636 1461.2222 1463.9584 1465.4534 1466.8315 1468.8737 1471.3116 1471.8092 1472.2343 1475.6066 1477.5198 1479.5818 1482.1552 1483.2537 1494.7497 1498.7647 1522.6533 1526.2418 1528.1502 1605.1700 1646.0239 1661.1523 1666.2062 1671.7507 1672.1459 1682.8473 1683.7771 2991.5764 2996.5620 3053.4319 3056.1321 3073.3533 3073.5671 3079.3499 3079.8697 3116.7245 3122.6174 3152.9801 3155.3804 3159.0728 3159.5644 3165.4653 3182.9963 3184.2312 3187.7688 3188.7910 3188.9792 3189.1240 3191.0222 3193.8659 3197.8991 3198.4130 3199.7228 3201.2629 3207.3579 3207.6327 3208.9772 3212.0223 3214.7879 3216.4897 3218.7977 3222.5787 3224.2478 3225.1639 3227.0790 3228.0543 3233.4448 3235.8616
redmass: 5.1238 4.5436 4.4465 4.5432 4.3469 4.6078 5.1371 4.7137 4.9676 4.1196 4.5356 4.0136 4.7903 3.8944 3.9412 3.9873 3.2445 6.2930 5.4582 4.0156 2.4520 1.7553 3.9941 1.0725 2.3971 1.1675 1.2409 3.6099 1.7597 2.3918 3.0696 2.5442 1.9918 2.7741 3.3659 2.5803 3.4407 3.6837 3.5447 3.0551 1.8082 3.9097 4.5525 2.7947 4.6559 2.7499 5.5781 4.1066 2.9340 3.6145 4.6635 3.5480 4.3266 3.6970 4.5997 4.6943 4.9206 3.6188 3.3192 4.5939 3.0458 3.2850 3.8626 4.4499 4.1380 3.8282 4.4717 3.8807 4.2790 4.3899 5.9623 6.4077 6.3959 3.7610 3.6861 4.8779 2.5075 5.7300 4.5148 5.2300 1.7229 1.6169 5.8285 3.9418 1.6555 3.1818 1.9045 1.5040 1.3343 1.8316 3.1072 1.4139 4.3979 2.1243 1.3091 2.0363 1.3028 1.6030 1.3493 2.3167 1.3876 1.9921 2.4089 1.3865 1.6566 1.6121 1.5967 3.0617 2.9383 1.3568 1.3862 1.9612 1.8079 2.9787 2.4018 5.3721 1.3811 1.3325 1.4571 1.8769 1.5472 1.5036 2.9968 3.4596 2.5560 1.3617 2.6892 1.4061 1.5656 1.5203 1.5284 1.2612 2.8354 2.9374 3.0193 2.6013 4.6081 1.5867 1.8870 2.1737 2.1027 1.1616 1.0977 1.4037 1.1102 1.1253 1.1388 1.1410 1.1203 2.9310 2.3850 2.0225 2.4847 1.7335 3.2508 3.9615 1.5048 2.0075 2.0993 1.6901 1.6178 1.6122 6.2414 2.9202 3.7394 3.2545 1.6475 1.5517 3.7880 1.5754 1.5210 1.9076 1.4462 1.3072 1.3521 1.0957 1.0678 1.1062 1.0998 1.1422 1.0825 1.1242 1.0512 1.0615 1.8380 1.5416 1.1544 1.0757 2.2395 1.1329 1.5803 1.5223 2.4456 1.2270 2.0749 2.3025 2.2283 5.5214 6.2400 5.9207 6.1425 6.1122 5.6298 5.9887 6.1547 1.0521 1.0521 1.0361 1.0378 1.0376 1.0378 1.0638 1.0623 1.0896 1.0881 1.1046 1.1049 1.1021 1.1034 1.1045 1.1054 1.1055 1.1028 1.1058 1.1058 1.1007 1.1021 1.0868 1.0860 1.0855 1.0885 1.0868 1.0922 1.0908 1.0898 1.0923 1.0966 1.0938 1.0938 1.0975 1.0970 1.1009 1.0965 1.0969 1.0967 1.0959
irintensity: 0.0118 0.1107 0.1071 0.2801 0.1582 0.0687 0.0596 0.0358 5.3368 0.4289 0.1365 1.4366 0.3869 0.7172 0.8486 0.3034 0.3617 8.6156 4.6743 0.5611 0.4884 0.8310 0.9400 0.2037 0.8048 0.1450 1.6923 1.7605 2.1967 0.5018 0.1873 0.3147 0.8710 3.4301 0.7296 0.5137 3.7685 1.3849 2.9968 6.8789 7.7016 6.9377 10.0342 2.6603 5.7018 2.0555 2.7310 3.0879 0.5922 1.4331 3.5677 2.8095 5.0321 7.6539 8.1768 33.7550 5.5410 4.6638 23.3852 12.0119 3.8250 16.5917 37.3648 25.3565 70.0975 20.3270 47.4992 5.4077 12.6891 73.4104 0.8881 0.1323 0.8952 3.3238 27.8582 9.0662 2.1118 1.4355 12.4951 15.5009 36.6755 21.2445 9.4177 7.8528 97.8459 6.6995 4.2806 16.5689 42.8724 6.5570 10.4008 3.8532 13.5560 1.1128 0.8521 12.4470 1.1795 3.0549 0.8736 19.8518 0.4838 8.7148 58.8623 1.2134 1.7225 17.1077 0.8304 11.9040 20.2673 1.2996 0.5375 56.6779 0.6155 0.6845 34.6164 0.9443 0.2260 0.0729 0.0992 6.0122 3.6200 1.9081 1.7531 0.7863 4.0230 5.0686 0.9972 0.2138 1.9926 1.0173 2.4668 2.5472 25.5226 5.5064 3.4198 35.5477 63.8971 2.7996 25.9841 23.0518 88.9517 11.3360 0.0555 0.7259 2.0037 4.9801 1.5493 2.5997 1.3078 29.9751 102.9802 30.1829 28.6157 11.7240 26.4496 198.6274 17.2456 34.8545 1.4920 2.6932 5.0423 8.7982 3.5574 41.8244 0.1814 0.3327 8.8864 5.7771 7.2297 31.3541 13.2230 77.6480 47.3018 24.9771 26.0266 2.5101 1.9351 0.6090 2.6773 2.8269 10.6019 10.9377 2.6372 1.7560 7.0335 8.8763 1.3210 5.3721 10.5504 8.7268 6.4381 15.6433 12.3270 5.6294 51.6561 1.7728 17.5509 20.3375 0.7392 0.0699 1.4184 0.2872 12.4974 10.5167 2.4232 55.7978 155.6605 18.1985 11.9017 6.8927 3.2594 29.7265 22.4977 16.2628 6.2975 9.8158 12.1810 6.3545 15.9029 8.5280 8.7476 12.5522 2.0234 1.9669 8.7061 9.2022 4.5635 2.0066 0.0320 0.7490 0.0651 0.3733 1.5628 9.8154 4.3320 9.9140 13.6493 7.5056 16.1860 4.2516 11.3009 21.6665 24.2478 11.2265 7.5869 10.0103
temp: 298.150 k
press: 1.00000 atm
elementType: 6 6 6 6 1 1 6 6 6 6 1 6 6 1 1 1 15 6 6 6 6 1 6 1 6 1 1 1 6 6 6 6 1 6 1 6 1 1 1 15 6 1 1 1 6 1 1 1 8 6 1 1 6 8 6 1 1 1 8 6 1 1 1 28 6 6 6 6 1 6 1 6 1 1 1 7 6 1 1 1 6 1 1 1
symmnumber: 1
zpe: 1837738.8 jmol-1
zpe.correction: 0.699958 hartree
zpe.thermalcorrener: 0.739972 hartree
zpe.thermalcorrenthalpy: 0.740916 hartree
zpe.thermalcorrgfe: 0.629853 hartree
zpe.sumelectzpe: -3865.255972 hartree
zpe.sumelectthermal: -3865.215958 hartree
zpe.sumelectthermalent: -3865.215014 hartree
zpe.sumelectthermalfe: -3865.326077 hartree
dipole: 0.1860 1.4891 -2.0129
dipole: 2.5107
quadrupole: -267.4021 -268.2523 -262.3498
quadrupole: 3.2561 -0.0373 5.6059
quadrupole: -1.4007 -2.2509 3.6516 3.2561 -0.0373 5.6059
hfenergy: -3865.9559301 hartree
pointgroup: C01 [X(C36H41N1Ni1O3P2)]
dipole: 0.0731683 0.5858628 -0.7919236 debye
polarizability: 511.9311797|-0.1546672|450.9658245|-14.478943|-35.4600035|437.5800951 unknown
InChI: InChI=1/36C.N.Ni.3O.2P.41H
charge 0 multiplicity 1
84 atoms
C  -2.0508477 -0.12151133 1.93883303
C  -3.17018597 -0.27850508 -0.55118239
C  -3.46006575 -1.73269512 -0.16476489
C  -3.66042776 -1.83132138 1.35470904
H  -4.38777989 -2.06349826 -0.65737742
H  -2.63310076 -2.38038204 -0.48559495
C  -1.12407184 1.84037072 -0.14791396
C  -2.10548374 2.84136874 -0.20911204
C  0.22126502 2.18095413 -0.396531
C  -1.75754488 4.16116853 -0.4837919
H  -3.15366641 2.57205407 -0.07384958
C  0.55526609 3.51158582 -0.67118157
C  -0.42370709 4.50006423 -0.70706644
H  -2.53474379 4.9270911 -0.53464806
H  1.59142879 3.7769783 -0.89144265
H  -0.14737426 5.53345487 -0.92799957
P  1.46312279 0.79497733 -0.41215341
C  2.48829423 1.22655043 -1.87626852
C  3.86873936 0.98650724 -1.88844833
C  1.85966871 1.58638919 -3.07710796
C  4.60319705 1.11770303 -3.06663853
H  4.37617507 0.68854493 -0.96743526
C  2.59396482 1.72058416 -4.25280454
H  0.77997573 1.75912624 -3.09247434
C  3.96940024 1.48575976 -4.25231817
H  5.67935061 0.92992767 -3.05624477
H  2.08798322 2.0079616 -5.17743943
H  4.54512581 1.5890173 -5.17468608
C  2.57241432 1.2095529 0.99867945
C  2.63090525 0.27648649 2.03767492
C  3.34535591 2.37534519 1.09161949
C  3.42970364 0.50640708 3.15787298
H  2.04967579 -0.64399211 1.95361731
C  4.14353112 2.60691967 2.20843735
H  3.33975548 3.10547433 0.2793297
C  4.18402893 1.67347257 3.24667732
H  3.46350924 -0.23655613 3.95785504
H  4.74033072 3.51984288 2.26952055
H  4.81199185 1.85686989 4.12166763
P  -1.44839887 0.04406306 0.15055653
C  -3.20289361 -0.0586087 -2.05050745
H  -4.19557781 -0.32330247 -2.44562908
H  -2.99960565 0.99402579 -2.2949286
H  -2.43995095 -0.68323982 -2.53793468
C  -0.90515712 0.06346475 2.90971112
H  -0.11045232 -0.65991349 2.6892509
H  -0.48684967 1.07761374 2.82324778
H  -1.25740069 -0.09210946 3.94106117
O  -2.49008875 -1.47826985 2.06081454
C  -3.23323252 0.79273982 2.2418465
H  -3.50749429 0.67485196 3.30212125
H  -2.97193065 1.84579464 2.07251877
C  -4.44258412 0.38201384 1.39555179
O  -4.18645843 0.54904288 0.01545989
C  -5.68595389 1.18437638 1.70168606
H  -5.96543465 1.05486586 2.75537633
H  -5.50637458 2.24933101 1.50088486
H  -6.50617191 0.83018867 1.06364738
O  -4.72700793 -0.96839929 1.68924234
C  -4.03416923 -3.22137587 1.81431625
H  -4.17884108 -3.2099387 2.90249291
H  -4.96518909 -3.54229326 1.32911215
H  -3.2287517 -3.92589523 1.56615019
Ni 0.31786353 -1.00818789 -0.34256876
C  1.25645119 -2.7393289 -0.49864466
C  0.24739904 -2.92178336 0.50883509
C  2.63013801 -2.89607201 -0.14031754
C  0.67181321 -3.13397454 1.84897528
H  -0.77202177 -3.22209586 0.26656939
C  2.99000435 -3.10824773 1.1711439
H  3.40221476 -2.82405457 -0.90716122
C  2.00628188 -3.20735908 2.18351498
H  -0.09888878 -3.26354288 2.61258976
H  4.0475395 -3.19375248 1.43034193
H  2.30539311 -3.37085273 3.22111901
N  0.80790009 -2.54819981 -1.84496775
C  -0.17731009 -3.4755599 -2.37293064
H  -0.63727059 -3.04170329 -3.27305259
H  0.27532826 -4.44982661 -2.64500246
H  -0.97510636 -3.66349525 -1.64614675
C  1.81972293 -2.21357958 -2.82790529
H  1.32844458 -1.82085655 -3.72947204
H  2.47933387 -1.42751813 -2.44158009
H  2.43305283 -3.08984704 -3.11925147
