program: Gaussian 16
title: NiPOOMe2Phdppf_03_opt2_redelim_18ts_1irc_n2brcfcb_io14
version: ES64L-G16RevC.01
method: RwB97XD
basis: def2SVP
operation: Freq
keyword: #P
keyword: Geom=AllCheck
keyword: Guess=TCheck
keyword: SCRF=Check
keyword: GenChk
keyword: RwB97XD/def2SVP
keyword: Freq
converged: YES YES YES YES
title: Mulliken charges:
elementType: C C C C C H H H H C C C H C H C H H Fe P P C C C C H C H C H H H C C C C H C H C H H H C C C C H C H C H H H C C C C H C H C H H H Ni C C C C H C C H H H H P O O O C H H H C H H H
charge: 0.030438 0.024118 -0.247944 0.047096 0.013726 0.032730 0.042114 0.023959 0.031149 0.022010 0.021978 0.028318 0.032233 0.009279 0.031186 -0.199087 0.040400 0.036258 -0.262625 0.498136 0.441263 -0.170328 -0.031428 -0.010104 -0.012973 0.039165 -0.018352 0.033133 -0.011417 0.022233 0.023090 0.025606 -0.165238 -0.010405 -0.001830 -0.020724 0.031225 -0.024414 0.033341 -0.022250 0.021356 0.019832 0.021367 -0.113142 -0.016571 -0.040210 -0.016189 0.004297 -0.013219 0.034377 -0.016296 0.018675 0.022963 0.022625 -0.179290 -0.016753 -0.022199 -0.018941 0.032639 -0.018104 0.030915 -0.012278 0.016003 0.022463 0.023356 0.067200 -0.030838 0.025585 -0.057688 -0.075320 0.015642 0.068741 -0.421424 0.005910 0.004026 0.044981 0.003551 1.074109 -0.526231 -0.494365 -0.477520 0.150484 0.056502 0.041320 0.038085 0.133362 0.052943 0.043582 0.044623
chargesum: -0.00000
title: Mulliken charges with hydrogens summed into heavy atoms:
elementType: C C C C C C C C C C Fe P P C C C C C C C C C C C C C C C C C C C C C C C C Ni C C C C C C P O O O C C
charge: 0.063168 0.066232 -0.247944 0.071056 0.044876 0.054242 0.053164 0.068718 0.045537 -0.199087 -0.262625 0.498136 0.441263 -0.170328 0.007737 0.023029 0.009260 0.004738 0.014188 -0.165238 0.020820 0.031511 0.000632 -0.004582 -0.000883 -0.113142 -0.012275 -0.005833 0.002486 0.009744 0.006329 -0.179290 0.015886 0.008716 -0.002938 0.004359 0.011078 0.067200 -0.027286 0.041227 -0.053663 -0.030339 0.074650 -0.421424 1.074109 -0.526231 -0.494365 -0.477520 0.286391 0.274511
chargesum: 0.00000
polarizability: 5.77535474e+02 -1.21982456e+01 4.85634480e+02 -1.66245583e+01 -2.52499205e+01 5.31905958e+02
1716.lowfreq: -7.8706 -2.6217 -0.9214 -0.0020 0.0019 0.0026 6.3482 12.8808 25.3615
frequency: 5.8318 12.5932 25.3501 32.2721 37.1462 41.4257 46.6960 49.2029 51.0019 57.5570 59.9405 66.5503 69.1268 79.1213 80.3223 82.7183 89.5712 91.7010 102.6601 110.6632 110.8632 113.9359 118.6862 123.3424 142.5311 144.5936 158.3045 161.2497 177.7096 182.1576 201.5520 211.9452 214.1704 224.7853 232.5262 239.9575 245.2983 247.6152 254.6704 264.1640 266.1900 270.0304 275.9254 279.8871 284.4029 301.8062 342.0903 360.1422 375.4583 391.8571 412.8378 417.1174 424.1308 426.3108 427.1459 430.3694 448.8899 458.2443 465.5487 479.1394 486.2958 490.9276 493.8097 512.9541 517.8299 520.2872 525.3750 536.7575 540.2892 543.6654 548.9389 562.8167 570.6749 619.6222 624.3454 628.7304 633.9531 634.0664 635.5828 635.6572 675.9310 677.0022 680.0759 709.4663 711.0311 714.7675 723.7170 726.1710 727.6990 728.3179 732.0650 737.1940 745.3833 776.8881 778.6359 785.0753 785.5611 793.8239 826.5011 841.4668 854.3835 860.6661 864.5446 867.7779 870.5976 877.3966 882.2386 886.7786 888.8770 895.5461 903.4867 904.8404 909.4288 927.0489 931.8512 946.7492 951.3566 953.7184 960.2436 968.4978 969.5098 982.6570 983.5693 1000.2838 1017.1946 1018.6675 1018.9489 1019.1662 1019.9502 1020.3889 1021.5590 1024.5224 1035.8690 1037.7192 1038.7368 1044.2144 1050.0822 1058.1964 1059.2308 1059.8512 1060.9625 1061.7202 1063.8618 1065.1422 1068.9432 1069.5340 1071.4778 1086.7163 1107.6167 1110.0500 1111.4803 1112.4648 1118.5435 1132.2877 1138.8040 1140.1023 1141.4195 1142.1865 1152.7038 1177.1757 1177.6461 1178.6092 1179.7640 1182.1339 1183.8901 1189.7756 1195.8315 1202.1655 1208.2165 1208.4361 1212.4878 1214.1117 1217.2339 1220.5384 1223.6227 1227.5974 1232.4392 1238.7081 1282.7967 1322.8106 1326.3736 1331.1049 1336.0095 1364.6617 1368.6319 1368.8045 1370.9853 1379.0823 1379.4824 1386.5594 1439.2231 1439.3935 1448.2389 1458.1343 1460.4028 1463.9279 1468.2283 1477.4585 1478.3274 1478.3824 1482.2007 1483.1899 1486.0107 1488.2831 1489.3687 1490.1178 1491.9081 1493.7994 1526.8780 1529.5053 1530.5407 1533.4998 1584.8588 1662.8257 1663.3900 1665.8837 1667.3668 1683.6054 1684.2800 1684.4054 1685.5982 1686.2422 3042.1851 3057.5375 3138.8879 3158.6862 3165.2439 3172.5672 3174.0105 3180.7638 3189.8453 3193.8220 3198.5040 3198.8936 3199.1058 3200.8561 3205.1615 3206.2263 3206.5039 3207.1863 3208.6421 3214.1070 3215.7216 3216.2914 3216.4732 3217.3574 3222.8979 3224.9550 3225.0827 3225.7388 3227.0529 3228.6782 3230.6144 3255.0433 3257.1060 3261.4823 3266.4196 3272.2299 3275.5719 3280.2516 3283.2195
redmass: 6.2032 4.6661 4.3052 4.4173 5.0280 4.4430 4.1860 4.6432 4.6674 4.4730 3.7444 4.7871 5.1270 3.7956 4.7377 4.0128 4.4410 4.9642 4.7486 5.1426 2.5177 2.4236 2.1716 1.2039 5.2602 6.5762 4.1609 10.5333 6.3924 5.3662 4.9841 5.0120 5.3789 5.5057 5.0128 5.2238 4.7623 4.6090 4.7497 5.3231 4.7814 6.7656 5.3445 5.4397 5.5833 7.7892 5.6094 5.9844 3.9583 6.8565 2.8478 2.9150 2.9656 5.0223 3.2515 4.5059 7.2901 6.1483 5.6672 4.8814 8.4619 7.1230 7.6723 4.4556 4.9737 5.5391 6.0848 7.2060 5.4038 5.3886 5.9833 7.4599 7.9064 6.1461 3.8950 3.9960 6.3810 6.3232 6.3327 6.4089 6.1440 4.4870 6.0787 5.5474 5.9886 6.4587 2.3897 6.5011 1.6988 2.7738 1.6155 1.7095 1.3516 1.8601 1.9435 1.9382 1.9852 6.7103 1.3311 6.9851 1.2647 1.3937 3.5533 4.2535 1.1964 1.2603 1.2524 1.2464 1.2263 1.2618 1.5442 1.9711 2.2811 1.6242 1.6753 1.2901 1.2639 1.4009 1.3810 1.5620 1.7398 1.3548 1.6509 1.3165 1.4629 4.9097 5.0562 5.2149 2.0827 3.5146 1.8829 1.4048 1.3727 1.3278 1.3350 1.3543 1.3168 1.8640 1.6486 1.6130 2.5014 1.8239 1.6553 2.3909 1.8818 1.4108 1.2070 1.2864 2.0761 1.7073 1.5259 1.7108 1.5527 5.7219 2.9455 2.8695 2.8136 2.9385 4.5161 1.1000 1.0959 1.1014 1.0959 1.1359 1.2839 1.2567 1.1555 1.1139 1.1283 1.1430 1.5008 1.6633 1.1436 4.8508 3.0230 3.7228 2.3136 1.5277 1.7191 1.6077 1.8429 1.5663 1.6708 3.5317 3.1070 3.5924 2.6602 2.4651 3.9853 4.5120 2.2124 4.9509 5.3317 3.6701 3.5618 1.1010 1.1170 2.0750 1.1292 2.3037 2.3092 2.3065 3.1305 1.4233 2.8578 1.5285 1.0629 1.0575 2.3129 2.2517 2.2611 2.2180 5.9732 5.9813 5.8564 6.1293 6.0391 6.0292 6.0239 6.1018 5.6535 5.9807 1.0320 1.0305 1.1075 1.0895 1.1081 1.1069 1.1085 1.0921 1.0932 1.0857 1.0860 1.0877 1.0872 1.0859 1.0896 1.0918 1.0899 1.0916 1.0897 1.0946 1.0964 1.0962 1.0960 1.0940 1.0972 1.0975 1.0998 1.1008 1.0986 1.0989 1.0990 1.0908 1.0907 1.0957 1.0948 1.1002 1.1005 1.1031 1.1024
irintensity: 0.1164 0.0702 0.5287 0.5663 0.3313 0.2261 0.6506 0.5462 0.2998 0.2965 0.5804 0.1932 1.9377 0.2016 0.8743 0.2243 0.3237 0.3330 0.0724 0.5163 0.2885 2.2537 0.3537 0.0576 1.9816 0.2049 1.3821 0.5667 0.1047 1.3313 0.3761 0.4987 3.2722 2.0045 0.9622 1.8514 0.1107 11.2177 7.4506 1.7625 0.6430 1.3743 12.1516 4.4727 4.7615 5.8200 7.4723 4.5858 11.5420 30.1800 0.0758 0.2459 0.3278 4.4362 0.9872 0.3241 23.1330 41.3935 15.2826 8.2578 31.9878 14.6113 5.8110 27.8620 68.2727 58.3361 57.2420 2.4267 42.1849 32.6554 21.3797 54.0031 50.0422 3.0516 1.5886 0.5290 0.4903 1.4539 0.3961 0.6251 13.0110 8.6592 16.1904 7.6335 3.5489 4.6716 45.3496 5.7446 39.2695 19.4514 27.0649 28.2538 82.8911 2.2208 8.3966 4.3850 5.8229 148.8822 7.9886 125.8567 32.9288 4.8644 0.3080 0.6867 3.0067 1.2685 1.2100 1.1727 6.8676 0.2330 48.8895 0.8882 1.0369 5.9001 1.8591 1.6106 0.4509 0.0801 0.8527 6.7183 13.6635 0.4343 3.6225 1.0491 0.3860 2.3788 1.1477 1.0576 2.1983 1.1935 0.6803 0.0908 0.3613 0.0551 0.1105 0.3722 4.6899 5.2109 1.5566 3.2047 2.8025 6.6240 6.5209 3.9299 7.0161 7.3760 9.8264 19.3044 59.7260 21.2886 3.6240 24.2481 2.4979 260.2440 16.1716 10.8088 33.3206 19.8080 268.5989 0.2944 0.2479 0.2788 0.1242 1.5032 2.3921 0.4208 1.2134 1.6089 4.5087 4.7284 46.8502 55.3842 1.5329 15.9388 32.8783 35.3764 60.9501 12.5840 13.1545 3.6806 3.0445 1.4025 3.7473 0.4170 1.4255 0.9177 0.6069 15.8095 4.0397 2.6278 0.9740 2.7355 1.3172 1.8325 0.7927 1.2653 2.4234 16.7792 1.3005 18.5109 6.4635 23.7850 2.4309 12.2965 1.9521 5.5585 10.2054 5.0382 5.9780 13.6804 5.9552 13.8441 33.8738 0.7255 0.6395 1.0095 1.5889 2.7574 0.4223 1.4114 3.2651 5.4304 59.7040 51.2006 22.1951 5.1351 13.4721 9.5552 12.1403 0.5979 39.3979 1.7712 0.4630 3.7766 0.2659 0.6773 1.5264 1.2549 5.2519 2.1987 2.4315 13.8484 6.6095 12.6049 9.6907 5.1997 8.2138 8.9173 28.7302 15.4210 15.7366 13.0165 11.0702 3.2631 1.3985 1.8119 1.3491 2.3803 1.7636 3.2763 2.3710
temp: 298.150 k
press: 1.00000 atm
elementType: 6 6 6 6 6 1 1 1 1 6 6 6 1 6 1 6 1 1 26 15 15 6 6 6 6 1 6 1 6 1 1 1 6 6 6 6 1 6 1 6 1 1 1 6 6 6 6 1 6 1 6 1 1 1 6 6 6 6 1 6 1 6 1 1 1 28 6 6 6 6 1 6 6 1 1 1 1 15 8 8 8 6 1 1 1 6 1 1 1
symmnumber: 1
zpe: 1864349.1 jmol-1
zpe.correction: 0.710093 hartree
zpe.thermalcorrener: 0.756116 hartree
zpe.thermalcorrenthalpy: 0.757060 hartree
zpe.thermalcorrgfe: 0.627651 hartree
zpe.sumelectzpe: -5642.648277 hartree
zpe.sumelectthermal: -5642.602254 hartree
zpe.sumelectthermalent: -5642.601310 hartree
zpe.sumelectthermalfe: -5642.730720 hartree
dipole: -0.6014 -2.5912 -1.6229
dipole: 3.1161
quadrupole: -304.7371 -310.7155 -308.7661
quadrupole: -6.0874 -1.3317 -14.8700
quadrupole: 3.3358 -2.6425 -0.6932 -6.0874 -1.3317 -14.8700
hfenergy: -5643.3583702 hartree
pointgroup: C01 [X(C42H39Fe1Ni1O3P3)]
dipole: -0.2365971 -1.0194753 -0.6385019 debye
polarizability: 577.5354741|-12.1982456|485.6344795|-16.6245583|-25.2499205|531.9059585 unknown
InChI: InChI=1/2C17H14P.C8H11O3P.Fe.Ni/c2*1-3-9-15(10-4-1)18(17-13-7-8-14-17)16-11-5-2-6-12-16;1-10-12(9,11-2)8-6-4-3-5-7-8;;/h2*1-14H;3-7H,1-2H3;;/rC42H39FeNiO3P3/c1-46-50(45,47-2)40-26-16-15-25-31(40)44(40)48(27-17-7-3-8-18-27,28-19-9-4-10-20-28)41-36-32-33-37(41)43(32,33,36,41)34-35(43)39(43)42(43,38(34)43)49(44,29-21-11-5-12-22-29)30-23-13-6-14-24-30/h3-26,31-39H,1-2H3
charge 0 multiplicity 1
89 atoms
C  0.11049864 -2.07889541 -3.59850069
C  0.42196342 -1.12736812 -2.59025809
C  0.97853127 -1.8288808 -1.46958632
C  1.01123988 -3.22030118 -1.80717793
C  0.47198577 -3.37027633 -3.11595344
H  -0.35010547 -1.86002886 -4.55993684
H  0.2745085 -0.04887669 -2.63247697
H  1.33927066 -4.03017306 -1.15947172
H  0.33103812 -4.31319275 -3.64136796
C  -2.78165732 -3.3045777 -2.14085407
C  -2.17662094 -3.86826533 -0.98237361
C  -2.86120239 -1.89629753 -1.9575423
H  -3.10485591 -3.85013294 -3.02544962
C  -1.86933909 -2.80794434 -0.08523522
H  -1.95144272 -4.9207727 -0.82141186
C  -2.29806037 -1.57403694 -0.68010905
H  -3.24658064 -1.1805219 -2.68010531
H  -1.35286464 -2.91767417 0.86632337
Fe -0.90457151 -2.50536631 -1.85349938
P  1.40412077 -0.94907154 0.06232744
P  -1.97128043 0.09060428 0.00061786
C  1.36070042 -2.22660345 1.38121001
C  0.49627453 -2.01419164 2.46154146
C  2.16295586 -3.37436487 1.3673397
C  0.40487286 -2.95109753 3.49049989
H  -0.10706676 -1.10152181 2.49402075
C  2.06884264 -4.31287235 2.39221527
H  2.88117795 -3.52603461 0.55743806
C  1.18419638 -4.10564262 3.45220359
H  -0.27323189 -2.77026554 4.32737857
H  2.6954929 -5.20726499 2.36957428
H  1.11438298 -4.84110816 4.25688339
C  3.21522063 -0.70226403 -0.13228974
C  4.01192211 -0.53118 1.00820013
C  3.81734919 -0.64385204 -1.39343964
C  5.38508581 -0.32779397 0.88896036
H  3.55463515 -0.56937379 2.00003882
C  5.19210215 -0.442316 -1.51160508
H  3.20860401 -0.76100226 -2.29199566
C  5.98065055 -0.28912997 -0.37245573
H  5.99407392 -0.20525876 1.78747553
H  5.64917098 -0.40820328 -2.50317271
H  7.05837413 -0.13777824 -0.46608774
C  -3.19219916 0.25769484 1.36400802
C  -3.38788166 -0.78309518 2.27932198
C  -3.80131388 1.49455097 1.61499923
C  -4.17958502 -0.59578378 3.41123604
H  -2.92127367 -1.75571351 2.11245704
C  -4.59491856 1.68089608 2.74466896
H  -3.65126771 2.32671361 0.92340693
C  -4.78577389 0.63650282 3.64856592
H  -4.32330395 -1.42134914 4.11190068
H  -5.06340548 2.65168644 2.92105569
H  -5.4055651 0.78307256 4.53573446
C  -2.6812777 1.14978842 -1.32156507
C  -1.81751346 1.9505594 -2.07495536
C  -4.05275658 1.15743452 -1.61389872
C  -2.3188192 2.74294194 -3.10942911
H  -0.74457698 1.95532457 -1.86182396
C  -4.55042881 1.95223895 -2.64230818
H  -4.73621371 0.53649827 -1.02891798
C  -3.68181973 2.74704393 -3.39360623
H  -1.63366184 3.36118666 -3.69369569
H  -5.62084588 1.9523928 -2.85983824
H  -4.07262157 3.37067397 -4.20097856
Ni 0.03606214 0.67253243 0.56747832
C  0.33005164 1.62283074 3.85447314
C  -0.63282215 1.96715013 2.94715887
C  1.71750787 1.68499087 3.50657396
C  -0.31613248 2.29887051 1.57814021
H  -1.6793194 2.00843393 3.25942912
C  2.08872197 2.01054058 2.23574946
C  1.0946123 2.22064871 1.20701836
H  3.1439817 2.11557856 1.97705668
H  2.4769415 1.5062145 4.27096256
H  -0.99334855 2.98176491 1.05269398
H  0.04318241 1.3653393 4.8768092
P  1.59010766 2.90240824 -0.36484088
O  1.46610416 2.04322933 -1.58941893
O  3.093041 3.46723662 -0.18343393
O  0.6905122 4.24022064 -0.47083808
C  4.2002307 2.91981921 -0.8798895
H  3.87424865 2.40628856 -1.79534723
H  4.87811806 3.74560729 -1.1356546
H  4.73044812 2.19983065 -0.23894084
C  0.61995597 4.94877668 -1.69249277
H  -0.32004008 5.51591088 -1.69439242
H  1.46559504 5.64913808 -1.78159667
H  0.63275556 4.25658472 -2.54891946
