program: Gaussian 16
title: NiPhClPAdDPi1_25
version: ES64L-G16RevC.01
method: RwB97XD
basis: def2SVP
operation: Freq
keyword: #P
keyword: Geom=AllCheck
keyword: Guess=TCheck
keyword: SCRF=Check
keyword: GenChk
keyword: RwB97XD/def2SVP
keyword: Freq
converged: YES YES YES YES
title: Mulliken charges:
elementType: C C C C H H C C C C H C C H H H P C C C C H C C H H H C C C C H C C H H H P C H H H C H H H O C H H C O C H H H O C H H H Ni C C C C H C H C H H H C H H H C H H H Cl
charge: -0.197503 -0.232478 0.196646 0.081011 0.032527 0.059012 -0.098101 -0.038017 -0.181028 0.001123 0.038818 -0.009961 0.001148 0.029646 0.039283 0.033670 0.371440 -0.176715 -0.005635 -0.115095 -0.015036 0.027426 -0.041943 0.001196 0.020110 0.014536 0.025390 -0.167721 -0.022141 -0.082319 -0.012700 0.035616 -0.049764 0.002681 0.022645 0.010659 0.024921 0.367322 0.087281 0.040241 0.049685 0.046176 0.063584 0.044054 0.078460 0.030458 -0.364464 0.172438 0.038164 0.031668 0.083943 -0.387972 0.064848 0.052782 0.045548 0.031344 -0.359354 0.068432 0.037173 0.044174 0.043844 0.126971 -0.090372 -0.054740 -0.036491 -0.026827 0.011488 -0.029017 0.014259 -0.031852 0.003350 0.010909 0.007803 0.048968 0.088125 0.033746 0.055062 0.052632 0.038307 0.064665 0.031335 -0.351497
chargesum: -0.00000
title: Mulliken charges with hydrogens summed into heavy atoms:
elementType: C C C C C C C C C C P C C C C C C C C C C C C P C C O C C O C O C Ni C C C C C C C C Cl
charge: -0.197503 -0.232478 0.288185 0.081011 -0.098101 0.000801 -0.181028 0.030769 0.029322 0.034818 0.371440 -0.176715 0.021791 -0.115095 0.005074 -0.027408 0.026586 -0.167721 0.013475 -0.082319 0.009945 -0.039105 0.027602 0.367322 0.223383 0.216556 -0.364464 0.242270 0.083943 -0.387972 0.194523 -0.359354 0.193623 0.126971 -0.090372 -0.043252 -0.022232 -0.023477 -0.018108 -0.024049 0.225900 0.186939 -0.351497
polarizability: 5.12531985e+02 -2.41833696e+01 4.51062503e+02 7.35675932e+00 -1.31940597e+01 4.15846721e+02
1716.lowfreq: -5.9453 -4.0226 -2.6717 -0.0040 -0.0032 0.0032 19.5286 21.9303 35.5370
frequency: 19.5110 21.9067 35.5331 41.3914 43.6323 55.3666 59.6627 66.6155 75.8484 83.7817 91.7910 101.9886 106.2732 118.6069 127.6935 132.5094 146.0689 163.0830 169.2885 170.6322 181.7481 193.2635 202.0943 213.8183 222.9597 223.4509 225.4184 228.1289 230.7704 236.0020 237.0100 245.5013 247.0241 251.2402 268.6657 269.9607 273.2361 276.4979 283.7758 287.8645 301.9154 309.8676 324.5904 339.4202 362.4830 386.9459 394.7219 404.2814 410.7983 413.6368 416.7567 433.6715 445.0340 453.3310 465.0811 468.1814 477.4559 480.4510 492.1026 493.7997 502.5628 506.5775 518.9670 528.7938 531.8359 541.2850 554.1096 570.7455 572.7245 578.2385 592.8282 612.7691 630.3554 652.7992 679.5106 682.7243 688.9024 697.7203 709.6489 717.4563 723.4051 745.2631 747.3450 750.1576 757.1586 773.3477 779.5875 780.9431 795.2425 823.4205 825.6942 826.4633 863.2720 873.3701 876.0628 884.1106 901.9995 905.7237 921.8874 926.8472 932.0327 934.7193 955.4505 979.0246 984.1179 989.2355 993.9840 997.5635 1006.5421 1012.4002 1014.2633 1017.3057 1017.8388 1020.7676 1023.7378 1024.9034 1035.2506 1036.8330 1052.6940 1052.7845 1055.6695 1056.3510 1061.4704 1071.6159 1080.5382 1082.4066 1083.2693 1093.3432 1099.3715 1099.9662 1100.8947 1108.6560 1137.7912 1151.7046 1158.7738 1164.8529 1166.5059 1168.6343 1170.6338 1172.6659 1174.4443 1185.2433 1187.2299 1187.7694 1200.9125 1221.2226 1225.9531 1236.9779 1243.8605 1246.1254 1252.1705 1259.9126 1281.5115 1288.6634 1304.8967 1306.1563 1307.7615 1314.3730 1315.8643 1347.3521 1348.4649 1352.4130 1358.5134 1382.5706 1384.2587 1402.4512 1403.4861 1410.7617 1412.4283 1420.6926 1437.2589 1448.4408 1452.4543 1454.4285 1457.6478 1460.2116 1463.5278 1464.8972 1465.7920 1467.9654 1468.6201 1469.6343 1472.4816 1474.3825 1474.5264 1479.4920 1488.6994 1492.0403 1497.3999 1498.4317 1516.0857 1525.5300 1526.5349 1648.2494 1651.1415 1656.2245 1658.9890 1664.5266 1671.2891 1687.4237 1689.9420 3036.1061 3051.7729 3056.6878 3066.4461 3075.0225 3080.4100 3089.6906 3091.8778 3128.2150 3148.4735 3153.9330 3157.7334 3161.7536 3162.6666 3164.5845 3168.5422 3168.6493 3183.4483 3186.4628 3187.1636 3188.8085 3192.4050 3195.8581 3199.3418 3199.4156 3200.0170 3204.7454 3205.8905 3210.2193 3211.1729 3214.3689 3214.3985 3218.1943 3221.2161 3224.0364 3228.0998 3229.3656 3236.8769 3261.0887
redmass: 5.5193 5.5519 5.1680 4.4513 5.4881 4.7223 5.2593 5.1439 4.6028 4.2074 4.1290 3.9835 7.6189 6.5400 6.3060 8.7336 5.5654 2.9694 3.8904 3.3430 3.8876 3.0338 1.7677 4.2969 1.6088 1.9255 1.1365 3.1750 1.1652 1.1524 1.7627 2.4263 2.2942 3.6636 2.8772 1.8483 2.9842 3.5471 2.2659 3.5761 3.4948 3.4902 8.5287 7.2440 5.0962 9.2638 3.6126 5.6503 4.3400 2.8249 3.2369 4.6979 3.5293 3.4509 3.7901 4.5888 4.9335 4.2689 3.9606 3.1568 3.7456 4.1181 2.6461 4.5531 3.8193 4.1377 5.0536 5.4365 4.0714 6.0872 4.2602 4.3280 6.3861 3.8571 4.2898 4.7999 5.4619 5.6067 5.9796 4.6494 1.7044 3.5268 4.0491 2.8621 1.9544 3.7872 1.3367 1.3660 1.2499 4.6850 3.3495 4.4783 4.2583 1.3490 2.0471 2.3827 1.2966 1.2872 1.6388 1.3556 1.4468 2.1123 2.1530 1.6494 1.5978 1.3681 1.3663 2.7457 1.3888 5.7997 2.0198 1.4930 1.4857 1.3867 1.9919 1.4143 1.3415 1.3422 1.6024 1.5772 2.9187 1.5092 3.9654 1.5650 2.4879 3.7389 2.8537 1.8104 2.6571 1.4431 2.4623 1.9895 3.1921 2.3335 4.8497 1.5800 1.8076 1.5789 2.1386 1.1182 2.0660 1.0997 1.1119 1.1255 1.1229 2.8712 2.2728 2.1098 2.2062 2.2574 1.6580 2.7933 3.1628 1.5646 1.9747 1.4392 1.4479 1.8244 1.9542 5.9578 7.5673 6.2964 3.0523 1.6232 1.5312 1.3897 1.3470 1.4066 1.2298 1.9614 1.9737 1.1708 1.1522 1.0882 1.0573 1.1120 1.0674 1.1605 1.7349 1.1119 1.1492 1.1109 1.0873 1.5808 1.3283 1.0879 1.9434 1.1263 1.7343 2.4275 2.2244 2.6693 2.6670 6.3237 5.8216 6.2153 6.3814 6.0664 6.1003 6.2400 6.3779 1.0389 1.0361 1.0361 1.0405 1.0365 1.0364 1.0656 1.0682 1.1032 1.0894 1.1015 1.1056 1.1051 1.1034 1.1049 1.1028 1.1050 1.1052 1.0870 1.1024 1.1058 1.1059 1.0927 1.0882 1.1000 1.0877 1.1046 1.0879 1.0902 1.0914 1.0930 1.0966 1.0949 1.0968 1.0971 1.0993 1.1004 1.0958 1.0938
irintensity: 0.0444 0.0279 0.2863 0.0808 0.7094 0.0923 0.6679 0.2795 0.3257 0.2685 1.0440 0.9964 2.6813 1.6562 1.0354 0.6950 0.7234 0.9715 0.0801 1.0181 0.3179 0.1313 0.1990 3.2050 1.5389 0.6942 0.7097 4.6092 0.9777 0.1871 1.2528 0.3103 0.0657 2.1095 1.8814 1.1116 3.6124 3.4462 0.9655 4.5900 2.7695 5.8145 8.5764 0.9421 8.1867 14.8984 1.7458 3.0753 2.0612 0.6954 1.0332 0.3086 1.3297 0.7378 4.1962 12.5648 11.5878 7.6135 29.4368 9.7724 10.1109 19.9334 2.2394 14.9317 3.5226 6.2142 22.6321 9.6460 6.3971 23.6378 15.3781 31.0453 0.2773 2.0977 7.9405 0.8369 4.6810 8.6229 2.7040 12.9989 28.2732 1.8289 12.1457 8.3710 49.0319 0.9283 16.8685 21.9256 25.1476 4.0363 14.6297 3.3137 4.8897 0.8685 2.0157 15.5025 0.1744 0.0394 1.2958 2.7089 5.3581 22.9735 9.6739 4.3548 2.5076 0.6234 1.0415 18.6944 0.1389 6.7080 52.6373 0.6711 2.7389 3.0768 33.1420 3.0784 0.1618 0.0112 8.3360 2.4929 7.3207 0.6593 1.1353 9.0089 1.1195 0.1190 0.3897 2.1202 2.3199 0.6366 4.4715 4.8566 2.2530 40.1396 73.8544 6.5845 22.1756 18.6428 55.6125 4.2710 63.5040 2.4569 2.5528 0.4461 0.8986 19.0275 94.6663 34.3208 4.1150 7.1880 16.2183 35.3650 179.4516 27.5379 22.1537 10.3466 4.2065 2.8385 3.7296 0.0731 0.4837 0.3954 1.0273 8.2836 2.8524 15.1687 7.8594 14.4836 6.3679 73.4218 71.9440 6.5438 14.3108 6.8165 3.1092 1.4210 0.8863 3.0833 1.8902 6.3130 4.2639 1.8991 1.0036 24.8419 0.2634 5.4869 19.0895 8.9757 25.1098 14.4310 19.9493 19.5451 10.4924 1.1874 5.8970 1.6449 1.9442 35.2183 0.6751 7.0008 9.0135 18.6305 12.5859 10.2850 6.5386 6.9750 10.3626 14.8550 20.0355 21.0311 4.4938 6.4385 6.6346 10.7323 10.0966 3.7929 4.0569 5.5212 10.8466 4.0087 5.5569 4.8131 4.0699 15.0688 1.4735 8.3963 2.0950 0.3307 0.8667 4.7960 5.8589 2.4059 25.2483 6.0824 16.5176 10.7943 10.9694 18.7821 6.3271 10.5545
temp: 298.150 k
press: 1.00000 atm
elementType: 6 6 6 6 1 1 6 6 6 6 1 6 6 1 1 1 15 6 6 6 6 1 6 6 1 1 1 6 6 6 6 1 6 6 1 1 1 15 6 1 1 1 6 1 1 1 8 6 1 1 6 8 6 1 1 1 8 6 1 1 1 28 6 6 6 6 1 6 1 6 1 1 1 6 1 1 1 6 1 1 1 17
symmnumber: 1
zpe: 1768358.4 jmol-1
zpe.correction: 0.673532 hartree
zpe.thermalcorrener: 0.713946 hartree
zpe.thermalcorrenthalpy: 0.714890 hartree
zpe.thermalcorrgfe: 0.603088 hartree
zpe.sumelectzpe: -4269.504113 hartree
zpe.sumelectthermal: -4269.463699 hartree
zpe.sumelectthermalent: -4269.462755 hartree
zpe.sumelectthermalfe: -4269.574557 hartree
dipole: -1.2784 7.2502 3.5996
dipole: 8.1949
quadrupole: -265.4355 -277.9514 -273.1160
quadrupole: -2.5339 -2.8317 -14.1890
quadrupole: 6.7321 -5.7838 -0.9484 -2.5339 -2.8317 -14.1890
hfenergy: -4270.177645 hartree
pointgroup: C01 [X(C36H39Cl1Ni1O3P2)]
dipole: -0.502954 2.8524391 1.4161907 debye
polarizability: 512.5319847|-24.1833696|451.0625034|7.3567593|-13.1940597|415.8467206 unknown
InChI: InChI=1/C30H34O3P2.C6H5.ClH.Ni/c1-21-13-7-9-15-23(21)34(24-16-10-8-14-22(24)2)25-17-11-12-18-26(25)35-29(5)19-27(3)31-28(4,33-29)20-30(35,6)32-27;1-2-4-6-5-3-1;;/h7-18H,19-20H2,1-6H3;1-5H;1H;/q;;;+1/p-1/rC36H39ClNiO3P2/c1-26-16-10-12-20-29(26)42(30-21-13-11-17-27(30)2)31-22-14-15-23-32(31)43(38(42,37)28-18-8-7-9-19-28)35(5)24-33(3)39-34(4,41-35)25-36(43,6)40-33/h7-23H,24-25H2,1-6H3
charge 0 multiplicity 1
82 atoms
C  2.19153526 1.06672291 -1.50601357
C  2.5058681 0.79594362 1.21606726
C  3.5532165 -0.2553529 0.85199222
C  4.17487392 0.08717622 -0.5041279
H  4.35042204 -0.21413677 1.60993554
H  3.12702779 -1.26391072 0.84119995
C  0.00843614 2.12559302 0.30102781
C  0.44572114 3.39188429 0.71844236
C  -1.37145754 1.92732983 0.10665574
C  -0.45653787 4.44506911 0.85232557
H  1.49647468 3.54565185 0.95748535
C  -2.26896519 2.99207265 0.22016291
C  -1.80972226 4.25697469 0.57547498
H  -0.09376325 5.42437356 1.1717381
H  -3.33461743 2.81941826 0.05082656
H  -2.51151806 5.08900201 0.66292651
P  -1.91541502 0.1965267 -0.12269398
C  -2.23511927 -0.34860584 1.61121337
C  -2.01461683 0.53172153 2.68093545
C  -2.60045943 -1.68880073 1.87528726
C  -2.14065586 0.11022778 4.00110075
H  -1.73649257 1.56853025 2.48821452
C  -2.73084011 -2.08424303 3.21271059
C  -2.49963042 -1.20753012 4.26794864
H  -1.96179814 0.81479213 4.81575815
H  -3.0168323 -3.11768929 3.42447487
H  -2.6039298 -1.55457764 5.29826298
C  -3.54520283 0.32733357 -0.93276721
C  -4.72412561 0.12942841 -0.2050892
C  -3.60306358 0.63751244 -2.30832701
C  -5.96762575 0.22668773 -0.82390178
H  -4.67013307 -0.10869684 0.85948636
C  -4.86330022 0.73268745 -2.90709645
C  -6.03443272 0.5278251 -2.18123778
H  -6.87893253 0.0652673 -0.24480896
H  -4.92329223 0.96820544 -3.97253736
H  -7.00281288 0.60337081 -2.6807623
P  1.08764568 0.65027688 -0.01804325
C  2.00286467 0.66036937 2.63915741
H  1.25262375 1.43016922 2.87108742
H  1.5493505 -0.33092601 2.78222308
H  2.84613247 0.77285873 3.33659927
C  1.41541348 0.95618949 -2.80218299
H  2.09156159 1.14348023 -3.64966689
H  0.98017846 -0.04845225 -2.90949927
H  0.60344733 1.69778953 -2.825035
O  3.20389598 0.07420096 -1.53634667
C  2.85168236 2.42806814 -1.3126079
H  3.45238221 2.6492508 -2.20818013
H  2.10658289 3.22531379 -1.19776872
C  3.80748449 2.3677763 -0.1136123
O  3.10853559 2.08425108 1.09175093
C  4.55062036 3.66210885 0.12203644
H  5.2169016 3.53974449 0.98575773
H  5.14946889 3.9135965 -0.76289498
H  3.84223806 4.47720345 0.32400008
O  4.75670801 1.3717261 -0.38769904
C  5.26145134 -0.87289955 -0.92062062
H  6.06933276 -0.86446452 -0.17734046
H  4.84557185 -1.88497987 -1.00012203
H  5.66122712 -0.56035708 -1.89414694
Ni -0.1319109 -1.05053974 -0.60291376
C  1.21057385 -2.32297018 -0.23705725
C  1.13869433 -2.82028661 1.07338662
C  2.13391401 -2.90320139 -1.11208631
C  1.98404245 -3.84588187 1.5070348
H  0.42089462 -2.39780097 1.78751516
C  2.98450944 -3.92160888 -0.68170897
H  2.19546066 -2.54920825 -2.14294884
C  2.91963474 -4.39343524 0.63149744
H  1.91133466 -4.21450718 2.5338859
H  3.70290475 -4.35878168 -1.38103657
H  3.58804193 -5.19062415 0.96518997
C  -2.81833214 -2.71625603 0.79691966
H  -1.87161952 -3.21667075 0.53912367
H  -3.52453243 -3.48576056 1.13831355
H  -3.19808537 -2.29330249 -0.14164666
C  -2.35615938 0.86656236 -3.11670693
H  -1.78485038 1.72620483 -2.73008354
H  -1.71171187 -0.02646503 -3.07189181
H  -2.59865769 1.07077498 -4.16804426
Cl -1.03587661 -2.34959404 -2.12723036
