program: Gaussian 16
title: NiPhClPAdDPi2_04_opt
version: ES64L-G16RevC.01
method: RwB97XD
basis: def2SVP
operation: Freq
keyword: #P
keyword: Geom=AllCheck
keyword: Guess=TCheck
keyword: SCRF=Check
keyword: GenChk
keyword: RwB97XD/def2SVPFreq
converged: YES YES YES YES
title: Mulliken charges:
elementType: C C C C H H C C C C H C C H H H P C C C C C H C H H H C C C C C H C H H H P C H H H C H H H O C H H C O C H H H O C H H H Ni C C C C H C H C H H H C H H H C H H H Cl
charge: -0.205768 -0.238018 0.196886 0.082997 0.032600 0.056310 -0.090171 -0.042634 -0.187521 -0.000712 0.042223 -0.010999 0.002713 0.029591 0.040457 0.032593 0.409405 -0.140699 -0.084752 -0.028232 -0.051128 -0.012907 0.032577 0.003079 0.009539 0.020197 0.022885 -0.204344 -0.109503 -0.002481 -0.046113 -0.015418 0.019997 0.003484 0.013967 0.021130 0.026604 0.367423 0.085803 0.042893 0.047021 0.046740 0.102238 0.034918 0.047610 0.043225 -0.370033 0.176154 0.036553 0.035274 0.086101 -0.386834 0.062754 0.053000 0.045009 0.032925 -0.359149 0.068440 0.043015 0.038551 0.042212 0.107436 -0.098972 -0.040059 -0.026475 -0.027286 0.011381 -0.031203 -0.001138 -0.035140 0.005685 0.009621 0.007595 0.061361 0.070014 0.063510 0.032237 0.054837 0.027692 0.071586 0.040520 -0.352884
chargesum: -0.00000
title: Mulliken charges with hydrogens summed into heavy atoms:
elementType: C C C C C C C C C C P C C C C C C C C C C C C P C C O C C O C O C Ni C C C C C C C C Cl
charge: -0.205768 -0.238018 0.285796 0.082997 -0.090171 -0.000411 -0.187521 0.028879 0.029458 0.035306 0.409405 -0.140699 -0.084752 0.004346 -0.041589 0.007291 0.025965 -0.204344 -0.109503 0.017516 -0.032146 0.005712 0.030088 0.367423 0.222457 0.227991 -0.370033 0.247981 0.086101 -0.386834 0.193688 -0.359149 0.192218 0.107436 -0.098972 -0.028678 -0.027612 -0.021600 -0.021582 -0.027545 0.227121 0.194636 -0.352884
chargesum: 0.00000
polarizability: 4.75234848e+02 4.71850041e+01 4.79175807e+02 -4.96623299e+00 3.14077823e+00 4.24407184e+02
1716.lowfreq: -6.9361 -5.2953 -3.3345 -0.0023 0.0033 0.0049 12.6454 30.3007 35.5992
frequency: 12.5191 30.2942 35.5984 39.0106 47.2236 52.1967 68.3478 74.4834 76.4407 83.9187 90.1809 103.5071 112.3770 119.7142 127.6377 133.5586 135.6598 152.4607 161.6715 171.7469 184.7324 185.9019 191.4909 215.8471 219.0902 220.4707 227.2657 232.4150 234.8484 244.1793 247.1892 252.1179 252.8576 255.0904 264.5480 268.0255 275.7096 276.5921 284.3772 288.6316 297.6173 311.1520 323.4559 339.0178 357.7098 380.5197 391.1749 402.7845 411.6541 413.5354 417.5546 438.2587 441.0665 455.7564 463.5024 464.5969 473.9307 481.5704 488.9719 496.6108 502.0877 511.4983 518.7153 524.4799 533.9016 541.3474 552.2088 571.2804 572.4194 580.8485 591.4509 609.9415 631.7310 652.2746 678.0995 683.2834 690.1831 699.4494 705.9206 717.1600 719.8784 745.7395 747.1787 751.1571 759.1473 773.7804 778.8032 783.7166 797.4541 823.8841 825.5957 826.7930 863.1586 867.5175 875.6820 883.1315 903.0195 903.7328 920.2051 922.5531 933.6281 939.9743 954.8176 977.0888 983.8736 990.1573 991.8934 997.8824 1002.1400 1013.5698 1014.7372 1015.1981 1018.5317 1022.9298 1023.8598 1027.6447 1035.0252 1036.5758 1048.4206 1054.8025 1056.7303 1059.6586 1061.2400 1066.0350 1080.1658 1082.1932 1084.1195 1097.4376 1098.7008 1099.2353 1101.4443 1110.6351 1137.4027 1152.7276 1158.5518 1166.0121 1167.6236 1168.3393 1169.8351 1172.5060 1174.4801 1185.2797 1188.0140 1189.8128 1202.7679 1221.8478 1224.7889 1235.7114 1242.6470 1249.3804 1253.4853 1260.8431 1281.9503 1292.0862 1304.2485 1305.7343 1309.9477 1313.4837 1315.1932 1347.3135 1348.8780 1350.9722 1357.9634 1382.4076 1384.8450 1399.9885 1402.9236 1405.2668 1406.4522 1420.6105 1435.1782 1443.8196 1455.4073 1460.1564 1461.7907 1462.2198 1463.2016 1464.5593 1465.1852 1466.9343 1468.0435 1469.0032 1469.9643 1472.9294 1475.3354 1476.7288 1479.6992 1493.7556 1497.3405 1503.6232 1516.8355 1523.8796 1528.1237 1649.5183 1653.1445 1657.6770 1658.7716 1663.8200 1672.5142 1688.5069 1689.8323 3045.4026 3054.5573 3061.9219 3062.5205 3074.7147 3079.2645 3085.3561 3095.3455 3138.8913 3140.3507 3157.1738 3163.0233 3163.5132 3164.4522 3172.4823 3177.2705 3179.6391 3180.2871 3180.9574 3184.2227 3188.6820 3191.0550 3194.3008 3199.1619 3199.8820 3200.9204 3201.1843 3204.2914 3210.8927 3212.6325 3213.6787 3215.5822 3217.9644 3220.4420 3224.9720 3228.0635 3230.4067 3238.4915 3257.6125
redmass: 5.6065 5.2015 4.3274 4.7387 4.4942 4.6674 4.8778 3.9877 4.9220 4.8960 4.2249 3.7544 1.8072 4.4261 4.7179 6.0422 7.2902 4.8514 5.2937 4.1110 4.0677 4.1466 3.5761 3.5863 3.5243 1.1272 1.0360 1.8568 1.7239 3.3697 2.5179 2.5606 1.5300 2.0691 1.1868 2.8698 2.9555 2.7651 3.1946 3.5398 3.6398 3.4238 8.5701 7.6959 5.3350 8.1026 3.7445 5.2781 2.7683 4.1924 3.3845 4.3490 3.7044 4.0746 4.0359 3.7696 4.9024 3.5188 3.6992 3.8793 3.7641 3.9829 2.7608 4.3160 4.0907 4.2416 4.8992 5.0770 4.2926 6.1074 4.2923 4.3432 6.3798 3.8469 3.5190 5.9593 5.6218 5.8796 5.9344 4.5349 1.6050 5.5172 2.8302 2.5547 2.0797 3.7867 1.3173 1.4894 1.2401 4.6214 4.6789 3.2104 3.7633 1.3262 2.2645 2.3953 1.2876 1.2897 1.3759 1.6411 2.4045 1.3096 2.1439 1.6592 1.5833 1.3676 1.3765 2.7941 1.5110 1.4878 3.9386 2.0506 1.4877 2.0045 1.4440 1.3665 1.3425 1.3524 1.6317 1.4819 2.9903 3.4910 1.6031 1.6107 2.6261 3.7641 3.2082 1.4777 1.6264 2.4231 2.3825 2.4049 3.2190 2.2736 4.9547 1.6578 1.9065 1.5707 1.8857 1.1200 2.0921 1.0981 1.1131 1.1348 1.1205 2.8724 2.2049 2.0772 2.2428 2.2189 1.7113 2.6855 3.6254 1.5258 1.9037 1.4336 1.4510 1.7766 2.0717 7.1224 5.6819 6.8559 2.8190 1.5938 1.5409 1.2984 1.3848 1.2853 1.4637 1.9797 1.5549 1.4271 1.0629 1.0933 1.1479 1.0831 1.1894 1.0811 1.1371 1.3812 1.2987 1.0983 1.1018 2.0734 1.2185 1.0907 1.0637 1.8615 1.6696 2.3955 2.2305 2.7425 2.6705 6.3941 5.8884 6.3537 6.2958 5.9930 6.0039 6.2361 6.3974 1.0388 1.0406 1.0363 1.0365 1.0366 1.0361 1.0633 1.0701 1.1027 1.0991 1.1050 1.1046 1.1036 1.1047 1.1058 1.0874 1.1010 1.1044 1.0903 1.1055 1.1058 1.1059 1.0923 1.0878 1.0967 1.0879 1.1046 1.0885 1.0908 1.0918 1.0924 1.0991 1.0984 1.0945 1.0972 1.0992 1.0996 1.0955 1.0938
irintensity: 0.2007 0.1754 0.0733 0.0188 0.0758 0.1244 0.2283 0.2665 0.3854 0.3199 1.1706 1.3568 0.7131 2.0499 0.5221 0.5348 1.2006 0.6474 1.5272 0.8219 0.5419 0.4070 0.2317 2.5046 0.3494 0.2851 0.0874 3.7834 3.0588 0.4375 2.1133 0.1342 0.3166 0.5604 0.0755 1.1558 4.2560 0.4843 4.0563 2.9074 2.5831 5.3505 9.0148 1.5881 13.3833 11.1610 0.1397 0.6115 0.2601 4.1780 0.5171 1.6324 1.5942 1.7683 9.6286 6.1845 4.9593 5.4368 31.4829 26.4367 7.1507 16.6227 3.5784 11.2407 3.5824 9.3960 16.7910 5.1985 13.4613 24.5740 12.8173 29.9379 0.0931 3.1740 6.3085 0.9838 8.6386 3.1909 3.4623 11.4849 34.9563 1.5004 5.4216 16.1159 51.2113 4.6486 21.0966 11.1995 22.1209 5.1383 6.7295 10.3685 4.4528 0.8651 2.5210 16.0568 0.0566 0.0665 2.9465 0.6298 25.8771 0.4457 10.2669 5.0626 2.2896 0.5062 1.2446 18.7935 1.4233 4.3694 5.9464 52.3131 0.3746 32.0154 3.7846 1.4510 0.0710 0.6634 10.1092 0.7915 7.2206 1.7546 10.6921 0.3795 1.1786 0.4719 0.2872 1.4361 1.9385 4.9658 3.3108 5.2862 1.4152 34.8960 70.5080 23.7684 23.7929 15.5257 27.4647 5.1168 73.5923 2.7759 1.7084 1.9480 0.4852 7.1929 100.1753 33.1335 5.6053 7.0831 18.7764 29.2124 202.9598 17.1533 24.3728 5.3097 7.7777 2.7747 2.7497 0.3876 0.3014 0.0376 0.6411 7.6807 2.6639 2.2982 24.5014 9.4237 14.0876 75.1609 52.9716 25.3124 6.2892 1.1074 4.7081 0.2410 13.5079 0.5346 1.5605 1.1723 7.4990 4.8011 1.5353 14.2610 4.2027 2.2491 10.6457 25.4883 25.7853 14.2671 23.8444 13.9032 18.9687 0.3668 1.9732 2.1843 2.4751 42.7955 0.4549 7.1310 7.4305 14.3133 4.7392 15.9334 2.7056 6.3479 10.4868 14.2980 18.5189 7.1278 10.7914 3.9187 10.0752 11.2877 8.3254 7.3357 3.8934 2.8805 4.5827 1.3006 9.5644 4.7349 4.3435 0.5931 1.9564 27.2977 1.9080 4.9116 0.3570 7.3116 6.7105 3.1017 35.5554 10.3409 6.9649 11.1827 10.5216 16.8181 7.2189 15.5425
temp: 298.150 k
press: 1.00000 atm
elementType: 6 6 6 6 1 1 6 6 6 6 1 6 6 1 1 1 15 6 6 6 6 6 1 6 1 1 1 6 6 6 6 6 1 6 1 1 1 15 6 1 1 1 6 1 1 1 8 6 1 1 6 8 6 1 1 1 8 6 1 1 1 28 6 6 6 6 1 6 1 6 1 1 1 6 1 1 1 6 1 1 1 17
symmnumber: 1
zpe: 1768514.3 jmol-1
zpe.correction: 0.673592 hartree
zpe.thermalcorrener: 0.713999 hartree
zpe.thermalcorrenthalpy: 0.714944 hartree
zpe.thermalcorrgfe: 0.603133 hartree
zpe.sumelectzpe: -4269.508108 hartree
zpe.sumelectthermal: -4269.467700 hartree
zpe.sumelectthermalent: -4269.466756 hartree
zpe.sumelectthermalfe: -4269.578567 hartree
dipole: -3.1407 7.7713 1.0706
dipole: 8.4500
quadrupole: -278.5492 -277.8826 -262.9921
quadrupole: 12.1717 5.7358 -2.6874
quadrupole: -5.4079 -4.7413 10.1492 12.1717 5.7358 -2.6874
hfenergy: -4270.1816999 hartree
pointgroup: C01 [X(C36H39Cl1Ni1O3P2)]
dipole: -1.235663 3.0574528 0.4212255 debye
polarizability: 475.2348478|47.1850041|479.1758075|-4.966233|3.1407782|424.4071837 unknown
InChI: InChI=1/C30H34O3P2.C6H5.ClH.Ni/c1-21-13-7-9-15-23(21)34(24-16-10-8-14-22(24)2)25-17-11-12-18-26(25)35-29(5)19-27(3)31-28(4,33-29)20-30(35,6)32-27;1-2-4-6-5-3-1;;/h7-18H,19-20H2,1-6H3;1-5H;1H;/q;;;+1/p-1/rC36H39ClNiO3P2/c1-26-16-10-12-20-29(26)42(30-21-13-11-17-27(30)2)31-22-14-15-23-32(31)43(38(42,37)28-18-8-7-9-19-28)35(5)24-33(3)39-34(4,41-35)25-36(43,6)40-33/h7-23H,24-25H2,1-6H3
charge 0 multiplicity 1
82 atoms
C  -2.09323081 0.00290626 1.4435236
C  -2.76058556 -0.60851497 -1.15405113
C  -3.20778544 -1.95257941 -0.58281405
C  -3.65133496 -1.77183674 0.86846885
H  -4.0791195 -2.28865189 -1.16528923
H  -2.42235644 -2.70973167 -0.65844475
C  -0.92464423 1.69589002 -0.7903811
C  -1.90490381 2.54306783 -1.33124108
C  0.40420269 2.15618644 -0.73681034
C  -1.56567842 3.80577941 -1.81032905
H  -2.93409136 2.19441726 -1.40298553
C  0.73697397 3.42333601 -1.22544011
C  -0.24528936 4.24958583 -1.76132321
H  -2.34221132 4.4424461 -2.2396504
H  1.77852116 3.75337362 -1.19794143
H  0.02091895 5.23503004 -2.14917504
P  1.65289676 0.99993242 -0.05583468
C  3.19533403 1.45298742 -0.92705192
C  3.30651335 1.23637477 -2.31968802
C  4.26761272 2.00018621 -0.21486117
C  4.50420842 1.59938038 -2.94286518
C  5.45466622 2.34276843 -0.85814682
H  4.17860324 2.16422159 0.86068449
C  5.57024506 2.1429387 -2.22929373
H  4.60432923 1.43982941 -4.01936162
H  6.28234926 2.76490682 -0.28491627
H  6.49356636 2.40713687 -2.74948183
C  1.88679832 1.60413496 1.66889954
C  2.47515662 0.76523091 2.64045987
C  1.44358147 2.8818925 2.03612736
C  2.58388275 1.24793742 3.9506969
C  1.55972388 3.33919911 3.34539042
H  0.98561658 3.53558373 1.29327049
C  2.13055341 2.51373142 4.30937935
H  3.03688559 0.6042507 4.7088053
H  1.20379873 4.33767226 3.60686538
H  2.22713366 2.85480521 5.34243801
P  -1.20398286 -0.0512192 -0.23081979
C  -2.51710486 -0.66562306 -2.64894983
H  -2.19084426 0.30682553 -3.04414063
H  -1.74650346 -1.41799188 -2.86641374
H  -3.44967978 -0.95301775 -3.15658695
C  -1.14042181 0.31763938 2.57655202
H  -0.7593694 1.34498729 2.49917583
H  -1.67138811 0.20390093 3.53316003
H  -0.2851557 -0.37246708 2.56428488
O  -2.5818819 -1.30895263 1.67690621
C  -3.27116563 0.971149 1.36815156
H  -3.73179746 1.03864201 2.36576502
H  -2.94327312 1.97691917 1.07250845
C  -4.32624331 0.42195201 0.4000376
O  -3.81283086 0.32877704 -0.92069236
C  -5.56318772 1.28529287 0.31443328
H  -6.26985762 0.82803944 -0.39019547
H  -6.03572176 1.35839728 1.30253565
H  -5.29989833 2.29184948 -0.03816107
O  -4.71452969 -0.83988852 0.87750565
C  -4.14895561 -3.047323 1.5018661
H  -4.45521532 -2.83943106 2.53547485
H  -5.00963386 -3.43083543 0.93861521
H  -3.34580034 -3.79490412 1.49658815
Ni 0.73925302 -1.05227786 -0.33974648
C  -0.02941255 -2.77463672 -0.47328294
C  -0.18736374 -3.4417902 -1.69578342
C  -0.3752974 -3.46437434 0.69572696
C  -0.72137918 -4.72948006 -1.75537496
H  0.1254872 -2.95508168 -2.62451667
C  -0.88879937 -4.76237567 0.64488131
H  -0.27289768 -2.98146581 1.67160584
C  -1.0807893 -5.39550037 -0.58271464
H  -0.84464026 -5.22298876 -2.72321522
H  -1.1458394 -5.2808849 1.57298274
H  -1.49324823 -6.40626547 -0.62525396
C  2.96432991 -0.62036533 2.32498808
H  2.12288069 -1.31819242 2.18309186
H  3.54248543 -0.66924486 1.39145073
H  3.58596732 -1.00984805 3.14222752
C  2.2032203 0.61793272 -3.13556126
H  2.46531527 0.60829948 -4.20190926
H  2.04738344 -0.4214914 -2.80605763
H  1.25085138 1.15911788 -3.02846162
Cl 2.69058957 -1.97809941 -0.7884854
