program: Gaussian 09
title: 000075741
version: EM64L-G09RevD.01
frameworkgroup: C1[X(C5H11N3O2)]
method: RPBEPBE
basis: SDD
operation: Freq
keyword: #p
keyword: freq=noraman
keyword: PBEPBE/SDD
title: #p freq=noraman PBEPBE/SDD
converged: YES YES NO NO
title: Mulliken charges:
elementType: O O N N N C C C C C H H H H H H H H H H H
charge: -0.456218 -0.310319 -0.111874 -0.369883 -0.374308 -0.319649 -0.322560 -0.329346 -0.318016 0.193738 0.203832 0.225498 0.234233 0.203210 0.212917 0.223134 0.331192 0.331868 0.212631 0.189235 0.350685
chargesum: 0.00000
title: Mulliken charges with hydrogens summed into heavy atoms:
elementType: O O N N N C C C C C
charge: -0.105533 -0.310319 -0.111874 -0.038691 -0.042440 0.109682 0.114882 0.106705 0.083850 0.193738
polarizability: 1.03848277e+02 8.31012612e-01 7.62905090e+01 6.34721426e+00 2.39518759e-01 5.95033086e+01
1716.lowfreq: -19.5625 -10.9452 -2.6200 -0.0003 -0.0003 -0.0001 46.8462 66.0848 82.3021
frequency: 46.6360 66.0618 82.2590 105.3009 154.7010 256.8248 265.7471 298.1904 323.1323 360.0675 405.0949 443.6817 491.1928 525.3932 573.8037 703.5768 740.5808 813.0045 816.9146 923.0914 976.1393 995.5235 1013.9336 1025.4390 1069.1925 1088.0357 1146.3508 1153.3026 1166.9283 1210.0089 1215.7273 1223.4985 1278.3114 1284.2346 1308.3134 1347.0552 1371.8511 1401.3574 1408.5332 1421.8996 1459.6114 1472.5632 1484.8731 1491.0771 1495.9995 1664.8209 2810.3939 2821.2926 2909.3883 2952.0523 3013.5550 3030.3885 3039.6917 3056.3184 3581.6925 3598.7238 3603.4167
redmass: 4.0734 3.5393 2.9568 2.2309 5.9214 2.6089 1.1112 5.3524 2.6968 2.7544 1.3159 5.1425 1.1634 4.6539 5.4558 9.1388 4.1608 2.7758 1.4612 3.6051 6.6634 2.4320 1.5989 2.2807 2.0986 1.9156 1.7154 2.3261 2.3533 1.3683 1.1345 1.5301 1.2025 1.3249 1.5466 1.4349 1.7141 1.3309 1.4895 1.4914 1.9371 1.0817 1.0889 1.2759 1.1011 4.8069 1.0723 1.0712 1.0697 1.0585 1.1008 1.0881 1.0890 1.0944 1.0667 1.0772 1.0787
irintensity: 3.0561 11.5996 1.0440 0.2841 9.8499 7.0820 161.2885 1.8825 3.9915 9.3104 4.0898 17.6810 229.8605 26.3420 0.3802 61.4803 3.9600 10.6437 1.9385 26.6194 89.7057 34.0376 10.2786 6.1969 9.7986 20.9246 14.8688 73.3763 61.4885 14.9790 1.8541 25.0443 5.1178 19.3103 76.0066 27.3568 11.8893 0.5353 38.5924 25.6457 124.3646 9.4996 4.6417 61.4602 4.0416 498.2312 50.9799 211.0885 72.0245 66.1430 41.0861 27.5366 27.0044 53.8671 5.2850 60.6369 22.1034
temp: 298.150 k
press: 1.00000 atm
elementType: 8 8 7 7 7 6 6 6 6 6 1 1 1 1 1 1 1 1 1 1 1
symmnumber: 1
zpe: 454501.7 jmol-1
zpe.correction: 0.173111 hartree
zpe.thermalcorrener: 0.183825 hartree
zpe.thermalcorrenthalpy: 0.184769 hartree
zpe.thermalcorrgfe: 0.136026 hartree
zpe.sumelectzpe: -511.009038 hartree
zpe.sumelectthermal: -510.998324 hartree
zpe.sumelectthermalent: -510.997380 hartree
zpe.sumelectthermalfe: -511.046122 hartree
dipole: 4.5217 0.0370 0.5858
dipole: 4.5597
quadrupole: -79.6135 -49.0544 -60.7428
quadrupole: -8.2564 -10.1854 -1.1031
quadrupole: -16.4766 14.0825 2.3941 -8.2564 -10.1854 -1.1031
hfenergy: -511.1821488 hartree
pointgroup: C01 [X(C5H11N3O2)]
dipole: -1.7775652 -0.0191823 0.2408733 debye
dipolederiv: -0.9309104 -0.059447 0.0760621 -0.0770383 -0.4133438 -0.2046365 0.1177252 -0.2028912 -0.3371966 -1.3362144 -0.1503094 0.2842281 -0.1612402 -0.6237723 0.0158413 0.3186246 0.0175839 -0.5153778 -0.7975308 0.0309882 0.0022748 -0.0071635 -0.4715629 0.0306879 -0.0503784 0.0002176 -0.5612692 -0.9075625 0.229639 0.1557188 0.3409012 -0.6342722 -0.1887141 0.1187028 -0.1715508 -0.6378086 -0.7454669 -0.2587785 0.0034699 -0.344342 -0.9286521 0.1107259 -0.0728081 0.0888791 -0.4979367 0.677831 0.0969712 -0.0601734 0.2973233 0.3586504 0.0090039 -0.0240387 0.0024855 0.7504005 0.7449458 0.0002019 -0.0652282 -0.1982659 0.4499791 -0.1736649 -0.1080723 -0.1705424 0.6337069 0.5749399 0.0310066 -0.0710252 0.0442153 0.1050316 0.0315681 -0.0553246 0.0194322 0.3075041 0.7432065 0.0534469 -0.0561578 0.075399 0.3217596 0.0892933 -0.036937 0.1122733 0.27785 1.7627637 0.1130894 -0.4794012 0.1034301 1.586721 0.1917358 -0.4350911 0.195785 0.4898828 -0.0855508 -0.0150582 0.0360968 -0.0923378 0.0164269 0.1083914 0.0359829 -0.0544916 -0.3060468 -0.0189032 0.1148409 0.0236105 0.1261584 -0.0794822 0.0088824 0.004356 0.0405187 0.0496402 0.0098013 -0.096216 -0.0235907 -0.0743895 -0.0797184 -0.0633095 -0.0355607 -0.0944655 0.0024189 -0.0911165 -0.0195843 0.0365642 0.0511689 -0.0395823 0.0525623 0.032717 0.2172564 -0.2546024 -0.044341 -0.0069872 0.0055215 0.0376018 0.066443 -0.041068 0.116853 -0.0021317 -0.2028276 0.0426872 -0.0045554 0.0024836 -0.0490533 -0.12377 -0.0252358 -0.0164071 -0.0403486 0.0723386 0.1262835 -0.0097186 0.0728535 0.0005074 0.1898044 -0.0201826 0.071777 -0.0054241 0.3351562 0.1329761 -0.0327849 0.0657014 -0.0450725 0.1929567 -0.0260417 0.0631565 -0.0402639 0.3279754 -0.0313548 -0.0030346 0.0450074 -0.0141121 0.0495624 -0.0619566 0.0487774 -0.0275318 -0.1847771 -0.0446466 -0.0793175 0.0164094 -0.112564 -0.2026589 -0.0080115 0.0102803 -0.0472633 0.0465404 0.2181629 0.0656079 -0.0704257 0.0988736 0.2594802 0.1641289 -0.1043345 0.1624732 0.2044288 unknown
polarizability: 103.7755027|1.0753694|76.2457273|-6.5725951|0.8049992|59.6208645 unknown
InChI: InChI=1S/C5H11N3O2/c9-2-1-8-3-6-5(10)7-4-8/h6-7,9H,1-4H2
charge 0 multiplicity 1
21 atoms
O  -4.188977 0.167804 -0.106526
O  3.479995 0.431278 -0.58668
N  -0.480114 -0.20327 0.011614
N  1.458931 1.187116 0.31612
N  1.747225 -1.087425 -0.185786
C  0.086433 0.939832 0.765692
C  0.370748 -1.39638 0.221822
C  -1.911264 -0.443123 0.312873
C  -2.8144 0.447445 -0.552121
C  2.303333 0.191635 -0.174865
H  0.062335 0.734462 1.869585
H  -0.527364 1.838509 0.579752
H  -0.019208 -2.222884 -0.398892
H  0.347992 -1.730701 1.293281
H  -2.161626 -0.275762 1.38728
H  -2.154034 -1.497555 0.089765
H  1.830889 2.134246 0.281449
H  2.337582 -1.814261 -0.586345
H  -2.66622 0.192735 -1.620541
H  -2.562607 1.519815 -0.40818
H  -4.829949 0.657986 -0.678899
