program: Gaussian 16
title: [Ni(Ph)(Cl)(PhPAdDP)]
version: ES64L-G16RevC.01
method: RwB97XD
basis: def2SVP
operation: Freq
keyword: #P
keyword: Geom=AllCheck
keyword: Guess=TCheck
keyword: SCRF=Check
keyword: GenChk
keyword: RwB97XD/def2SVP
keyword: Freq
converged: YES YES YES YES
title: Mulliken charges:
elementType: C C C C H H C C C C H C C H H H P C C C C H C H C H H H C C C C H C H C H H H P C H H H C H H H O C H H C O C H H H O C H H H Ni C C C C H C H C H H H Cl
charge: -0.205037 -0.241313 0.191082 0.081087 0.032539 0.025624 -0.115404 -0.039199 -0.132003 -0.002962 0.032595 -0.031110 0.000212 0.024469 0.024095 0.026351 0.375708 -0.152359 -0.019614 0.007135 -0.015429 0.022198 -0.015222 0.025009 -0.011259 0.021781 0.026807 0.025778 -0.161049 0.022924 -0.021999 -0.011189 0.025055 -0.015357 0.019670 -0.011196 0.023442 0.021101 0.025992 0.319938 0.074693 0.047982 0.058573 0.042097 0.090636 0.032785 0.037192 0.060491 -0.372183 0.182060 0.031091 0.029955 0.085816 -0.381451 0.062793 0.042495 0.033375 0.050333 -0.363355 0.056004 0.049294 0.041227 0.041859 0.077889 -0.158743 0.076116 -0.105067 -0.074402 0.015855 0.021259 0.046009 -0.034447 0.010629 0.014629 0.006174 -0.128553
chargesum: -0.00000
title: Mulliken charges with hydrogens summed into heavy atoms:
elementType: C C C C C C C C C C P C C C C C C C C C C C C P C C O C C O C O C Ni C C C C C C Cl
charge: -0.205037 -0.241313 0.249245 0.081087 -0.115404 -0.006604 -0.132003 0.021507 -0.007015 0.026563 0.375708 -0.152359 0.002584 0.032144 0.006352 0.011585 0.014519 -0.161049 0.047978 -0.002328 0.012253 0.005744 0.014797 0.319938 0.223345 0.221104 -0.372183 0.243107 0.085816 -0.381451 0.188995 -0.363355 0.188384 0.077889 -0.158743 0.091972 -0.059058 -0.063773 0.035887 -0.028273 -0.128553
polarizability: 4.68276212e+02 3.71153748e+00 4.41272679e+02 2.20674208e+01 1.35111727e+01 4.00651186e+02
1716.lowfreq: -4.8541 -2.7861 0.0034 0.0037 0.0045 3.4416 22.6593 25.7773 30.3195
frequency: 22.6590 25.7749 30.3180 38.3968 39.4637 49.8191 55.0530 59.8902 64.9123 71.2359 74.6032 88.2369 94.4909 116.6781 133.9878 142.8907 166.3423 169.5891 177.9025 200.2872 214.7104 220.3890 223.2327 235.0059 237.9763 239.6301 241.9779 244.1119 249.9878 255.7035 261.7543 264.1053 273.1470 279.3018 285.7612 290.0491 299.1691 320.2647 340.7782 364.4289 378.1918 389.6150 403.1840 409.2869 414.3281 417.6399 432.9447 440.0889 448.4209 467.3250 468.8297 474.5573 489.2908 506.4978 508.4582 516.4575 518.6216 526.0672 538.0791 540.4185 548.0117 571.1294 593.9449 609.6245 617.6414 633.3285 634.7126 654.1612 657.4509 682.4301 695.9058 709.7824 716.8439 718.6917 726.0888 729.1399 729.4336 742.2358 749.0239 773.3198 780.4962 783.4736 792.2658 814.1955 829.8506 866.0334 874.6232 882.7042 884.1847 885.7719 887.3401 919.1223 931.8917 934.1418 955.8278 965.8871 966.4118 967.4904 977.6103 982.4028 984.9469 990.3370 999.8168 1006.5144 1015.9018 1017.5362 1018.3694 1019.2432 1020.3593 1023.1770 1024.4967 1026.4388 1045.0097 1045.7821 1050.8754 1055.3905 1060.9395 1061.5454 1062.2303 1063.6088 1078.2718 1099.8111 1113.2910 1115.2332 1136.5570 1139.4878 1141.2741 1146.0960 1158.0446 1163.3716 1170.9969 1172.2637 1174.2326 1179.1928 1180.2212 1184.5807 1187.1987 1209.6603 1212.3367 1219.9311 1226.4597 1236.0620 1254.8530 1258.4812 1273.2020 1280.7838 1292.0011 1305.0349 1312.8098 1330.4312 1332.3689 1341.6022 1368.5376 1370.4085 1379.6545 1380.2723 1382.1778 1402.9527 1406.6508 1419.1278 1429.5392 1434.4839 1444.6025 1450.2932 1455.6819 1460.7251 1461.5122 1463.0225 1466.4183 1468.3518 1470.6299 1473.4846 1477.4532 1480.8602 1481.4057 1483.7186 1496.0774 1530.1832 1531.3873 1586.6228 1646.4093 1665.3094 1665.6710 1671.2415 1675.9703 1683.7729 1684.7665 3055.6807 3055.9426 3074.2100 3075.8082 3081.6771 3087.3728 3155.5699 3158.9504 3159.1517 3161.9687 3168.0033 3171.5155 3174.3666 3183.6230 3186.7893 3190.4988 3190.7458 3196.6569 3199.6608 3199.7729 3202.7888 3205.0008 3205.3612 3205.7016 3211.5290 3212.1381 3212.3613 3217.6337 3219.1619 3219.2091 3224.6428 3224.8854 3227.4570 3228.0317 3246.9759
redmass: 6.0623 4.4371 5.7829 4.6350 5.3994 4.0110 5.3039 4.9818 5.1223 5.5326 5.3961 5.4532 5.2300 8.8813 5.5673 4.5755 6.9403 4.6245 6.1677 4.5133 4.9923 1.0552 1.0274 4.1504 2.0418 1.4101 4.0702 2.3873 1.6781 1.9623 3.0343 4.5368 2.9401 3.0407 3.4820 3.4392 3.0979 5.5892 5.8942 4.4299 3.7041 9.6218 5.1667 4.6651 2.8626 2.8649 4.1992 4.8303 5.9978 5.1818 4.9986 4.3314 3.3447 3.8671 4.1737 3.2061 3.7611 4.3797 5.0881 4.1543 6.6090 3.8765 4.2295 4.7154 5.3253 6.4009 6.4179 3.7596 5.0546 3.8387 4.7259 3.4924 6.1394 4.1277 2.7788 2.5041 1.7192 6.7223 1.5447 3.0884 2.1640 1.9042 1.2692 1.3210 3.1390 4.7147 2.1184 2.1132 1.2485 1.5109 1.3309 1.6319 1.5550 1.8451 2.0106 1.4848 1.3889 1.4568 1.6931 1.9003 1.9314 1.3329 2.8939 3.8176 1.8982 1.6261 3.5514 4.5836 2.3588 2.2725 1.4854 1.4233 1.3510 1.3429 1.5486 1.5036 3.7727 2.5642 2.5371 1.5954 2.8221 1.4081 1.5290 1.5349 3.1050 2.8994 2.9231 2.4873 4.7528 1.6276 1.1032 2.2240 2.3187 1.0975 1.0987 1.1133 1.1193 1.1178 1.1208 2.9692 2.3344 2.0478 1.7111 2.7163 1.6173 4.0419 1.4699 2.0002 2.0974 1.6711 1.7357 7.7873 3.1606 2.9355 2.6139 1.7545 1.6131 1.3926 1.4667 1.9187 1.9980 1.7239 1.2130 1.1219 1.1495 1.0804 1.0641 1.0559 1.0486 1.0541 1.0652 2.1607 1.0680 2.3237 2.3298 2.3979 2.3988 2.2527 2.2380 6.2906 6.1277 6.0027 5.9664 6.0501 5.6469 6.0069 5.9875 1.0364 1.0364 1.0371 1.0364 1.0634 1.0649 1.1042 1.1044 1.1049 1.0902 1.1047 1.1051 1.1027 1.1054 1.1055 1.1059 1.1059 1.0852 1.0865 1.0865 1.0872 1.0901 1.0901 1.0892 1.0931 1.0931 1.0926 1.0968 1.0966 1.0968 1.0988 1.1004 1.1010 1.1010 1.0941
irintensity: 0.2668 0.0132 0.2147 0.0287 0.0859 0.0745 0.0787 0.1920 0.3158 0.1171 0.4573 0.1445 0.2559 1.6302 0.6031 0.2882 0.1062 0.1264 0.8550 0.4082 1.0612 0.1543 0.0615 0.1090 1.2912 2.9545 1.5139 0.0871 0.3299 0.2787 0.1117 0.3318 0.6921 1.2603 3.6973 3.2078 5.4614 0.5801 2.7074 2.8983 4.8333 7.7475 0.7197 3.5492 0.1591 0.3686 3.8829 0.1087 4.3840 2.7319 12.8750 14.0848 21.1085 15.9014 37.4451 10.5608 8.3240 41.8167 55.6799 13.5716 94.7703 2.7737 12.8935 54.3405 1.7097 0.0982 1.1485 1.9394 14.1562 20.8648 8.4230 2.5507 5.3681 18.5678 23.5160 26.6088 29.3123 8.9471 155.3649 3.2729 5.5526 12.4447 22.6173 22.4210 11.8889 10.0612 2.7709 8.6799 2.8290 21.0648 5.9592 3.1023 7.3111 13.6000 8.4669 3.2687 1.0366 4.0846 8.9836 2.1103 3.9673 2.5367 17.8325 21.2295 51.5682 6.4376 0.2159 1.7911 34.6932 10.1683 0.7530 0.6976 0.2283 0.0444 0.2495 1.4658 0.7780 1.7290 1.8141 14.6753 0.2225 0.0782 0.6463 1.8464 2.0913 21.6834 30.7170 29.4691 62.9972 8.9123 1.0641 23.6789 106.4132 0.6325 0.3641 1.1984 1.6723 1.3008 6.2699 18.2719 114.7711 35.3974 23.8126 21.6275 5.5574 211.4495 11.2038 29.7694 1.8912 5.0175 4.7716 2.7056 0.1524 0.4738 11.2275 17.4555 11.6281 25.9387 15.7989 83.6236 11.0155 69.4467 13.6380 9.2681 1.4285 1.5824 3.7927 4.8389 1.9791 2.9800 1.1933 12.6120 4.1408 7.8534 23.7296 0.2877 16.3739 7.3767 5.4416 26.4837 0.4565 0.1411 0.8704 1.4318 2.2918 0.0742 0.1169 20.6706 1.1722 5.9660 6.1027 21.0543 21.8887 2.1381 9.3122 15.5424 7.8365 5.4394 2.9893 1.5916 9.3066 9.6457 2.4092 7.7324 0.6743 0.2841 2.1496 0.9304 4.4742 8.0958 6.9365 1.0635 0.6123 2.5551 13.3505 5.0134 7.4147 18.1560 10.6469 22.3633 22.3035 7.6284
temp: 298.150 k
press: 1.00000 atm
elementType: 6 6 6 6 1 1 6 6 6 6 1 6 6 1 1 1 15 6 6 6 6 1 6 1 6 1 1 1 6 6 6 6 1 6 1 6 1 1 1 15 6 1 1 1 6 1 1 1 8 6 1 1 6 8 6 1 1 1 8 6 1 1 1 28 6 6 6 6 1 6 1 6 1 1 1 17
symmnumber: 1
zpe: 1618462.7 jmol-1
zpe.correction: 0.616440 hartree
zpe.thermalcorrener: 0.653863 hartree
zpe.thermalcorrenthalpy: 0.654808 hartree
zpe.thermalcorrgfe: 0.547805 hartree
zpe.sumelectzpe: -4190.962581 hartree
zpe.sumelectthermal: -4190.925157 hartree
zpe.sumelectthermalent: -4190.924213 hartree
zpe.sumelectthermalfe: -4191.031216 hartree
dipole: 0.3250 -4.6311 2.2645
dipole: 5.1653
quadrupole: -255.4891 -262.4790 -261.2661
quadrupole: 6.3792 -3.3430 3.2810
quadrupole: 4.2556 -2.7343 -1.5213 6.3792 -3.3430 3.2810
hfenergy: -4191.5790208 hartree
pointgroup: C01 [X(C34H35Cl1Ni1O3P2)]
dipole: 0.1278497 -1.8219977 0.8909113 debye
polarizability: 468.2762123|3.7115375|441.2726792|22.0674208|13.5111727|400.6511863 unknown
InChI: InChI=1/C28H30O3P2.C6H5Cl.Ni/c1-25-19-27(3)31-26(2,29-25)20-28(4,30-25)33(27)24-18-12-11-17-23(24)32(21-13-7-5-8-14-21)22-15-9-6-10-16-22;7-6-4-2-1-3-5-6;/h5-18H,19-20H2,1-4H3;1-5H;/rC34H35ClNiO3P2/c1-30-23-32(3)39-31(2,37-30)24-33(4,38-30)41(32)28-20-12-11-19-27(28)40(25-15-7-5-8-16-25,26-17-9-6-10-18-26)36(41)29-21-13-14-22-34(29,36)35/h5-22,29H,23-24H2,1-4H3
charge 0 multiplicity 1
76 atoms
C  1.99094561 0.12457169 1.6966676
C  3.01862157 -0.01367402 -0.84246198
C  3.46963757 1.42481321 -0.57712031
C  3.74205127 1.60990089 0.91962324
H  4.40479475 1.6126665 -1.12685349
H  2.70694065 2.13727183 -0.91532797
C  0.84191149 -1.93218568 -0.23483481
C  1.73815909 -3.00833536 -0.2985024
C  -0.53421107 -2.17644743 -0.43967067
C  1.28121998 -4.30034119 -0.55059091
H  2.80706337 -2.82244047 -0.19078137
C  -0.97889873 -3.47546855 -0.70106263
C  -0.07692878 -4.53593937 -0.75209257
H  1.99562587 -5.12462369 -0.60622994
H  -2.04119477 -3.65885656 -0.87890755
H  -0.43545596 -5.54596803 -0.96231517
P  -1.66046422 -0.71253972 -0.35144601
C  -3.12427491 -1.21873438 -1.32721002
C  -4.18077853 -1.97630331 -0.8060433
C  -3.17715024 -0.79637957 -2.66126303
C  -5.25936566 -2.32871144 -1.61526697
H  -4.16677894 -2.28682108 0.24162199
C  -4.25506219 -1.15334506 -3.46943298
H  -2.382332 -0.15992229 -3.05897504
C  -5.29506052 -1.92236788 -2.94915602
H  -6.0794003 -2.91855611 -1.19970429
H  -4.28741668 -0.81627565 -4.50770289
H  -6.14285104 -2.19615079 -3.58123959
C  -2.25616091 -0.77513772 1.38512199
C  -2.75444691 0.41848987 1.92191942
C  -2.19293552 -1.913965 2.19577115
C  -3.18750557 0.46982667 3.24444558
H  -2.7825797 1.32030173 1.30473135
C  -2.62327671 -1.85949376 3.52140778
H  -1.79006204 -2.84873611 1.7994224
C  -3.12033467 -0.66823069 4.04799758
H  -3.56757339 1.40920213 3.65179918
H  -2.56385182 -2.75274982 4.14726781
H  -3.45099708 -0.62562731 5.08816079
P  1.3163455 -0.15300009 -0.04901249
C  2.96287716 -0.33855155 -2.32216148
H  2.63792333 -1.37549926 -2.48761066
H  2.25484716 0.33486687 -2.82738269
H  3.96168802 -0.21064448 -2.76584542
C  0.87429516 0.15600187 2.71821018
H  0.35966279 -0.81448912 2.76627656
H  1.29044208 0.38974924 3.70992277
H  0.13785241 0.92785534 2.4531235
O  2.56365799 1.43201727 1.67883491
C  3.08564918 -0.88360441 2.02997998
H  3.41641503 -0.71741871 3.06717185
H  2.7113566 -1.91337568 1.95061525
C  4.29405939 -0.66235575 1.11082415
O  3.96441426 -0.89976156 -0.24531609
C  5.46008565 -1.56782898 1.43226511
H  5.79611539 -1.39366438 2.46271633
H  5.16432452 -2.61964603 1.31867851
H  6.28427114 -1.34800279 0.74123975
O  4.7242481 0.66666434 1.2921154
C  4.27334253 2.98182489 1.26242614
H  4.43978753 3.04020896 2.34592112
H  5.22306941 3.15704134 0.74053325
H  3.54735402 3.75072671 0.9662487
Ni -0.39323453 1.01030299 -0.66341325
C  -1.25466457 2.58643269 -1.42210941
C  -2.45475268 3.10786305 -0.81984835
C  0.03951852 2.89377949 -0.84585969
C  -2.40173518 3.68760682 0.41474947
H  -3.39834833 3.00136124 -1.35918727
C  0.02202392 3.5033408 0.46307494
H  0.90412756 3.07709137 -1.4930552
C  -1.14485433 3.85180122 1.08442216
H  -3.31941532 4.04319849 0.88896735
H  0.97945327 3.69673828 0.95331197
H  -1.1184364 4.30577962 2.07737936
Cl -1.30765463 2.38245141 -3.2046807
