program: Gaussian 16
title: NiPhCl_PhPAdDPi1_16
version: ES64L-G16RevC.01
method: RwB97XD
basis: def2SVP
operation: Freq
keyword: #P
keyword: Geom=AllCheck
keyword: Guess=TCheck
keyword: SCRF=Check
keyword: GenChk
keyword: RwB97XD/def2SVP
keyword: Freq
converged: YES YES YES YES
title: Mulliken charges:
elementType: C C C C H H C C C C H C C H H H P C C C C H C H C H H H C C C C H C H C H H H P C H H H C H H H O C H H C O C H H H O C H H H Ni C C C C H C H C H H H Cl
charge: -0.202044 -0.247453 0.184029 0.084266 0.030887 0.033038 -0.117213 -0.039033 -0.155317 -0.000844 0.034530 -0.010717 -0.002274 0.024658 0.013425 0.026392 0.379933 -0.167778 -0.017860 0.002152 -0.015997 0.032621 -0.014324 0.034358 -0.010669 0.023161 0.028428 0.027186 -0.145070 -0.007706 -0.022974 -0.018024 0.026464 -0.011351 0.034248 -0.012918 0.026253 0.022551 0.026249 0.326441 0.075531 0.044281 0.052083 0.039440 0.086684 0.021903 0.036637 0.065206 -0.366111 0.180366 0.029717 0.026254 0.086599 -0.382601 0.063989 0.031493 0.049869 0.041516 -0.364861 0.068408 0.039604 0.025224 0.046664 0.118649 -0.162251 0.012900 -0.029834 0.015095 0.050148 -0.018594 0.027274 -0.041621 0.014970 0.018329 0.013100 -0.217765
chargesum: -0.00000
title: Mulliken charges with hydrogens summed into heavy atoms:
elementType: C C C C C C C C C C P C C C C C C C C C C C C P C C O C C O C O C Ni C C C C C C Cl
charge: -0.202044 -0.247453 0.247953 0.084266 -0.117213 -0.004503 -0.155317 0.023815 0.002708 0.024118 0.379933 -0.167778 0.014762 0.036510 0.007164 0.014105 0.016517 -0.145070 0.018758 0.011274 0.008229 0.011201 0.013331 0.326441 0.211335 0.210430 -0.366111 0.236337 0.086599 -0.382601 0.186867 -0.364861 0.179900 0.118649 -0.162251 0.063049 -0.002560 0.030065 -0.000264 -0.028521 -0.217765
polarizability: 4.94871335e+02 5.43150524e+00 4.23898884e+02 -1.76806573e+01 -2.20600380e+01 4.17387781e+02
1716.lowfreq: -229.0216 -0.0035 -0.0019 -0.0009 2.7240 5.1768 6.8803 11.2685 23.9663
frequency: -229.0172 11.2644 23.9601 30.2819 34.4529 45.6453 47.1599 56.2389 63.5104 67.6325 75.6080 81.2288 91.3720 98.0719 126.4584 135.7171 144.7019 164.9105 170.8115 195.7260 201.5630 210.1688 210.7863 223.2032 224.1345 233.3931 235.4800 242.8850 246.1018 250.8955 256.2290 258.9820 270.4057 273.4043 278.3485 288.7541 292.2978 304.2669 308.4143 339.9392 363.7068 364.7137 403.4736 406.2905 415.8581 420.1714 433.3859 438.2129 446.3679 449.4673 463.7226 468.8158 473.8098 480.6852 490.0882 507.7750 513.6916 518.3927 531.8242 540.0602 548.0765 571.3559 593.9051 603.3696 610.5527 633.0363 634.0909 635.4722 652.2700 678.7306 682.5549 693.6122 714.1579 717.3656 726.2744 728.1133 730.3972 744.2781 745.1837 773.4048 774.3997 777.3670 782.3455 792.4243 830.0818 861.4440 865.8947 874.4821 879.7016 882.2510 886.5752 918.5953 928.6433 935.6365 955.4716 957.2033 967.9520 973.7316 979.2755 982.0363 993.4896 999.5849 1006.1777 1012.0712 1016.4118 1017.2097 1018.4387 1018.5605 1019.2639 1021.2764 1025.5016 1039.8410 1041.1711 1045.8193 1051.9693 1054.8221 1060.7754 1061.4321 1063.3064 1082.0976 1090.1726 1098.9958 1110.9895 1112.4365 1135.8569 1139.1561 1140.3458 1148.3370 1156.6789 1165.8416 1169.7893 1171.9970 1174.7819 1177.1760 1179.3106 1179.6970 1189.0799 1206.0372 1207.0204 1220.5686 1227.4342 1235.8585 1253.1128 1259.0249 1278.6650 1289.0661 1291.8431 1305.8982 1312.0238 1323.9283 1330.9153 1343.5665 1366.4367 1368.7322 1376.9122 1378.5154 1380.7272 1403.3789 1407.2795 1417.8641 1434.4241 1446.7795 1454.5658 1458.2866 1459.3010 1461.9498 1463.2248 1465.6449 1466.0485 1467.1628 1469.7725 1472.7835 1478.6761 1479.0655 1479.5934 1483.1906 1500.6541 1528.4135 1528.9695 1619.1822 1646.9725 1657.9224 1663.9517 1666.5882 1673.1677 1683.6194 1685.2664 3052.5322 3053.3754 3073.9735 3080.8848 3081.2108 3085.3491 3156.6432 3157.0898 3159.8281 3165.3408 3166.2847 3170.7880 3183.2546 3189.7457 3190.1623 3194.7779 3196.1689 3197.3774 3199.2251 3199.3526 3204.0132 3204.6475 3204.8779 3208.8304 3212.9699 3215.5662 3218.7466 3220.2431 3222.6875 3226.6134 3228.0914 3228.3378 3228.6429 3241.0089 3256.6900
redmass: 9.2263 5.7247 5.9298 6.1587 4.5559 4.6608 5.0234 4.4723 4.0176 4.9575 4.9685 6.6273 5.8066 5.6218 5.6402 5.2823 7.8357 4.2885 5.8507 5.4992 5.9276 4.3876 1.0685 5.1697 1.0461 3.4320 1.7264 2.1046 2.5191 3.1167 2.0192 1.3495 3.6480 3.4599 2.9747 3.2397 3.4492 3.2043 7.5818 6.3229 5.5715 5.3257 4.9702 4.5366 2.8772 2.8765 4.9690 3.7735 3.3697 6.2213 5.5184 4.8515 4.4819 3.7198 3.4629 3.7329 3.6321 3.1134 5.0599 4.3750 5.5240 3.8502 4.2698 5.7489 4.3031 4.8565 5.6591 3.7866 3.7691 1.8206 2.8916 4.8503 5.8448 4.8768 3.9509 1.8262 1.8273 5.3018 4.8606 1.3016 2.9499 1.9637 1.8085 1.4183 3.1492 1.4401 4.3383 2.0710 1.2499 2.3476 1.2435 1.6288 1.3539 2.2997 2.0254 1.3771 1.3663 1.7175 1.6528 1.5826 2.6884 2.8584 2.4365 1.6003 1.5522 1.8362 2.5350 3.8676 2.2948 2.2837 1.4025 2.0347 1.3901 1.3490 1.6132 1.4960 2.5038 2.5074 3.6220 2.7700 1.4000 1.4038 1.5204 1.5106 3.0762 2.9838 2.9158 2.3976 4.3305 1.6971 1.1112 2.1602 2.2584 1.1425 1.1000 1.0985 1.1238 1.1171 1.1162 2.9309 2.3136 2.0477 1.8485 2.4777 4.0966 1.4440 1.4541 2.0493 2.0582 1.6720 1.5662 7.8051 3.2061 3.7272 4.5879 1.7761 1.6103 1.3968 1.4580 1.9420 1.8903 1.1992 1.0906 1.0925 1.0953 1.9528 1.1107 1.0570 1.0656 1.0705 1.0807 2.1575 1.5783 1.7059 1.6404 2.3486 2.3823 2.2649 2.2760 5.7757 6.2124 5.9328 5.9815 6.0933 6.0146 6.0181 6.0731 1.0360 1.0360 1.0372 1.0401 1.0634 1.0620 1.1048 1.1050 1.1024 1.1045 1.1050 1.1030 1.1054 1.1058 1.1058 1.0887 1.0892 1.0870 1.1043 1.0897 1.0880 1.0872 1.0910 1.0920 1.0926 1.0926 1.0963 1.0960 1.0929 1.0993 1.0962 1.1006 1.1003 1.0945 1.0933
irintensity: 109.0343 0.1724 0.5750 0.1320 0.0856 0.0614 0.2704 0.2436 0.2660 1.6932 0.2304 1.7551 0.9149 0.2259 1.1613 1.3873 1.2663 1.2907 2.1475 5.8248 0.2803 10.3063 0.7942 2.8174 0.0312 8.9584 3.8445 0.3680 1.6938 1.2069 0.9079 0.2413 0.4555 3.7055 0.5738 2.8956 3.5836 5.6682 12.9482 5.2196 4.7885 0.2555 0.7466 5.0624 0.3183 0.1782 6.0163 0.7506 0.6011 3.8286 12.4696 12.4801 17.2857 20.5862 19.7341 11.4540 8.9953 10.8795 49.6110 36.6860 100.4259 3.2091 11.4302 5.3200 46.3049 16.5028 7.8676 36.6735 0.7569 72.3259 1.5846 7.8229 1.8431 15.7295 26.7626 28.3287 29.4688 33.8965 48.1223 34.6512 10.5630 10.7875 17.4691 17.7727 9.7831 12.0145 8.9062 2.0592 0.7171 13.2600 0.8945 4.6275 1.3366 18.3113 7.6653 0.0901 0.1570 4.3220 5.2391 1.4491 1.0690 15.4044 63.8301 18.7504 13.0209 39.0886 0.9106 2.1782 1.2171 42.9088 0.4829 2.4728 0.4519 0.2841 0.2265 1.4455 2.4751 2.8293 0.0600 0.4091 10.7667 0.1941 2.2939 0.9519 2.0012 22.5257 28.0796 34.2780 45.9127 14.8871 0.1822 29.5863 94.2850 2.4430 0.1993 0.2958 2.1189 5.4230 3.7040 18.8276 102.6798 31.7840 24.7993 19.2818 188.9538 2.8346 8.6570 26.4638 6.9062 4.6584 3.5254 2.2033 0.7240 1.2336 6.8748 10.3515 9.1191 23.6286 15.9557 80.8384 73.2558 13.1810 3.7084 0.2436 2.6684 1.6995 7.0471 4.6580 0.5297 2.9689 0.2933 11.1585 34.9242 18.0418 22.0826 13.9673 14.7712 6.3567 10.8636 26.6435 0.5016 46.1879 0.4763 1.0547 0.9552 0.1189 2.1303 15.3961 11.5177 5.8566 4.9180 22.7925 23.0246 6.2807 11.6733 8.5178 2.6422 4.8682 4.5039 10.5767 3.6259 6.5342 1.7057 0.5698 4.2886 5.1985 1.1664 0.1751 1.2731 13.1064 0.8315 3.5181 5.4191 9.8148 8.0201 10.6376 14.3367 6.2444 24.6779 11.6979 8.4902 10.2621
temp: 298.150 k
press: 1.00000 atm
elementType: 6 6 6 6 1 1 6 6 6 6 1 6 6 1 1 1 15 6 6 6 6 1 6 1 6 1 1 1 6 6 6 6 1 6 1 6 1 1 1 15 6 1 1 1 6 1 1 1 8 6 1 1 6 8 6 1 1 1 8 6 1 1 1 28 6 6 6 6 1 6 1 6 1 1 1 17
symmnumber: 1
zpe: 1615627.4 jmol-1
zpe.correction: 0.615360 hartree
zpe.thermalcorrener: 0.652582 hartree
zpe.thermalcorrenthalpy: 0.653527 hartree
zpe.thermalcorrgfe: 0.546399 hartree
zpe.sumelectzpe: -4190.940265 hartree
zpe.sumelectthermal: -4190.903043 hartree
zpe.sumelectthermalent: -4190.902099 hartree
zpe.sumelectthermalfe: -4191.009227 hartree
dipole: 2.8103 4.2186 1.3361
dipole: 5.2421
quadrupole: -249.2000 -265.4017 -258.5739
quadrupole: -0.0121 0.0747 -3.1385
quadrupole: 8.5252 -7.6765 -0.8487 -0.0121 0.0747 -3.1385
hfenergy: -4191.5556252 hartree
pointgroup: C01 [X(C34H35Cl1Ni1O3P2)]
dipole: 1.1056514 1.6597412 0.5256475 debye
polarizability: 494.8713348|5.4315052|423.8988838|-17.6806573|-22.060038|417.3877806 unknown
InChI: InChI=1/C28H30O3P2.C6H5.ClH.Ni/c1-25-19-27(3)31-26(2,29-25)20-28(4,30-25)33(27)24-18-12-11-17-23(24)32(21-13-7-5-8-14-21)22-15-9-6-10-16-22;1-2-4-6-5-3-1;;/h5-18H,19-20H2,1-4H3;1-5H;1H;/q;;;+1/p-1/rC34H35ClNiO3P2/c1-31-23-33(3)39-32(2,37-31)24-34(4,38-31)41(33)30-22-14-13-21-29(30)40(25-15-7-5-8-16-25,26-17-9-6-10-18-26)36(41,35)27-19-11-12-20-28(27)36/h5-22,27H,23-24H2,1-4H3
charge 0 multiplicity 1
76 atoms
C  -2.04859103 1.32456324 0.95613863
C  -2.55919566 1.20382509 -1.7326668
C  -3.64230643 0.19905878 -1.33534444
C  -4.16204471 0.53691834 0.06828804
H  -4.48130858 0.27963015 -2.04383195
H  -3.2414656 -0.8221014 -1.37309157
C  0.12608258 2.16789256 -0.98603779
C  -0.20946423 3.47093483 -1.38802385
C  1.48983761 1.80957806 -0.94714665
C  0.77778408 4.39808498 -1.71006944
H  -1.25871976 3.74574668 -1.48749437
C  2.47384523 2.7488132 -1.27331764
C  2.12372903 4.04250087 -1.64530221
H  0.49008529 5.40324528 -2.02619591
H  3.52706828 2.46089502 -1.24933381
H  2.90006524 4.76666234 -1.90130546
P  1.90321969 0.07077916 -0.49993269
C  3.33860659 -0.33966443 -1.55985042
C  4.66159394 0.01053823 -1.26079606
C  3.06627217 -1.06187073 -2.72836849
C  5.69262956 -0.33370502 -2.13235644
H  4.88934616 0.5446806 -0.33440113
C  4.09892302 -1.39958908 -3.60158546
H  2.04020263 -1.37673404 -2.93969979
C  5.41127734 -1.03349703 -3.3062477
H  6.72190041 -0.05828527 -1.89200101
H  3.87748708 -1.96279332 -4.5105944
H  6.22108378 -1.30448007 -3.9873815
C  2.6368349 0.22173422 1.17460482
C  3.21296495 -0.92340145 1.74350378
C  2.56797484 1.39181945 1.93661473
C  3.71304086 -0.8964965 3.041081
H  3.27555396 -1.84685536 1.16116927
C  3.06025495 1.41546571 3.2427552
H  2.12772525 2.29651693 1.51160095
C  3.63299907 0.27436432 3.79752277
H  4.16341424 -1.79551729 3.46745371
H  2.99593998 2.336006 3.82703948
H  4.01842069 0.29456626 4.81913065
P  -1.09886059 0.8241935 -0.60299575
C  -2.16130528 1.07659634 -3.18967604
H  -1.39588384 1.81978702 -3.45536423
H  -1.75529371 0.07105685 -3.37426454
H  -3.04077632 1.23715874 -3.83140316
C  -1.20085836 1.09085197 2.18854837
H  -0.32216456 1.75265974 2.18485708
H  -1.79533276 1.29083253 3.09290181
H  -0.85408841 0.04708123 2.21430386
O  -3.14414577 0.4141399 1.03780231
C  -2.60808656 2.73869332 0.85207659
H  -3.11965551 2.98770899 1.79515219
H  -1.80778708 3.47377318 0.69358483
C  -3.65060267 2.80035972 -0.27474833
O  -3.07372244 2.52134426 -1.53673574
C  -4.31233837 4.1535332 -0.39683786
H  -3.56092647 4.92386013 -0.61801425
H  -5.04589205 4.12015933 -1.21286622
H  -4.82533973 4.40500571 0.54057712
O  -4.65433522 1.86140757 0.02686281
C  -5.30141678 -0.3470298 0.51892637
H  -6.14415173 -0.25689204 -0.17874771
H  -4.97260198 -1.39252316 0.56543901
H  -5.62330583 -0.02767252 1.51869453
Ni 0.01748408 -1.03569607 -0.52059243
C  -1.00052651 -2.43364169 0.08001537
C  0.09283836 -2.71369314 0.93047923
C  -2.32024326 -2.66710439 0.50349361
C  -0.16599731 -2.94174184 2.29619394
H  1.09331174 -2.87222324 0.52514333
C  -2.54077363 -2.92029096 1.84299983
H  -3.14996051 -2.57978008 -0.19810071
C  -1.46961103 -3.02077813 2.75484358
H  0.67004982 -3.11638274 2.97815074
H  -3.56717968 -3.02337706 2.20362257
H  -1.67155852 -3.2171732 3.80949617
Cl -0.48827093 -2.82765052 -1.93709235
