program: Gaussian 16
title: [Ni(Ph)(Cl)(PhPAdDP)]
version: ES64L-G16RevC.01
method: RwB97XD
basis: def2SVP
operation: Freq
keyword: #P
keyword: Geom=AllCheck
keyword: Guess=TCheck
keyword: SCRF=Check
keyword: GenChk
keyword: RwB97XD/def2SVP
keyword: Freq
converged: YES YES YES YES
title: Mulliken charges:
elementType: C C C C H H C C C C H C C H H H P C C C C H C H C H H H C C C C H C H C H H H P C H H H C H H H O C H H C O C H H H O C H H H Ni C C C C H C H C H H H Cl
charge: -0.202729 -0.240065 0.168003 0.083875 0.032113 0.054743 -0.114360 -0.040975 -0.126014 -0.000367 0.040514 -0.005368 -0.002185 0.031431 0.022677 0.032348 0.438921 -0.113071 -0.027629 -0.008563 -0.014899 0.032045 -0.014796 0.033918 -0.006294 0.024825 0.032156 0.029369 -0.155929 0.028612 -0.027258 -0.018333 0.034345 -0.016102 0.032140 -0.008856 0.030316 0.023496 0.028862 0.341469 0.077478 0.036878 0.048527 0.044831 0.081331 0.021910 0.048952 0.055325 -0.365933 0.176633 0.035324 0.030844 0.089114 -0.382288 0.062053 0.043197 0.031735 0.052958 -0.361633 0.053190 0.044438 0.039659 0.059875 0.132644 -0.109808 -0.039617 -0.010532 -0.025484 0.000562 -0.024746 0.003995 -0.035117 0.006770 0.003284 0.007488 -0.366224
chargesum: -0.00000
title: Mulliken charges with hydrogens summed into heavy atoms:
elementType: C C C C C C C C C C P C C C C C C C C C C C C P C C O C C O C O C Ni C C C C C C Cl
charge: -0.202729 -0.240065 0.254859 0.083875 -0.114360 -0.000461 -0.126014 0.031063 0.017309 0.030163 0.438921 -0.113071 0.004416 0.025355 0.009926 0.017360 0.023076 -0.155929 0.062957 0.004882 0.011984 0.007395 0.020007 0.341469 0.207714 0.207519 -0.365933 0.242801 0.089114 -0.382288 0.189943 -0.361633 0.197161 0.132644 -0.109808 -0.039055 -0.006538 -0.018714 -0.021462 -0.027629 -0.366224
polarizability: 4.97103134e+02 -2.69114546e+01 4.12322080e+02 -1.26407684e+01 8.00367841e-01 4.00710691e+02
1716.lowfreq: -8.4079 -5.0459 -3.2084 -0.0027 0.0011 0.0030 16.7938 28.7971 39.5588
frequency: 16.5992 28.7524 39.5320 40.9552 48.1033 50.1981 56.6865 61.1275 70.1405 72.6437 80.3588 84.0306 86.7085 126.4847 134.3495 137.4483 154.0059 161.5414 181.2041 189.8838 208.9806 216.8286 222.9910 225.1216 227.6685 229.9735 240.0124 241.9304 247.3690 248.4579 256.4150 266.4831 272.1189 275.0348 282.0437 285.8987 291.7674 302.1383 323.7460 344.1511 367.4114 383.3414 401.0182 406.5223 410.2210 414.3627 422.3118 437.0480 441.6217 446.3872 470.6048 474.0651 475.0229 489.3445 501.7230 507.3592 514.7540 516.6343 535.2754 541.3102 563.7688 571.8903 595.0524 613.1923 631.0243 633.0792 634.3490 657.4305 681.0307 684.0645 698.8768 715.0643 717.3975 719.9567 720.2855 730.5387 732.0519 748.5847 759.3056 770.3220 778.6570 781.0927 792.2865 829.5258 863.6710 865.5485 869.4084 876.4981 883.9467 888.2778 922.0861 924.9506 927.4051 934.0511 952.7867 954.8480 971.8678 980.2982 987.9278 998.1483 1002.9627 1011.3958 1012.8449 1016.2208 1017.9283 1018.8883 1019.9887 1021.6808 1025.1837 1028.7752 1042.2252 1048.4796 1056.1499 1056.8172 1057.6537 1060.9491 1061.7922 1062.8974 1073.9465 1098.5806 1103.5989 1106.9774 1113.1943 1115.3386 1140.3951 1140.5122 1144.1728 1156.2177 1161.2500 1165.5789 1172.1965 1173.1509 1178.5651 1180.2267 1180.3579 1186.5653 1203.2100 1206.7830 1209.1858 1221.4301 1226.0952 1244.4180 1255.4726 1262.1578 1281.6761 1287.9375 1310.2812 1313.5564 1315.2594 1324.3631 1332.1728 1351.2963 1359.2557 1366.8448 1369.0258 1380.8578 1391.5321 1399.3822 1406.5949 1421.2337 1437.8732 1452.5341 1457.4747 1461.5133 1462.1624 1465.1493 1465.5723 1466.8692 1467.6375 1470.2336 1473.6230 1475.9960 1477.5946 1479.2101 1484.4384 1501.1766 1517.2150 1527.8982 1528.7542 1648.3315 1654.0409 1663.3525 1665.7902 1667.9360 1672.9407 1684.6515 1685.6297 3050.7270 3058.5690 3071.9881 3074.4958 3077.3678 3084.5502 3147.5360 3158.5416 3158.8720 3160.1172 3163.6597 3163.9903 3169.3641 3183.5915 3183.9335 3188.8859 3189.0837 3190.7737 3193.0515 3198.4734 3203.2634 3203.7301 3205.4787 3209.0119 3209.2530 3211.4259 3213.9029 3215.6324 3217.7391 3221.8036 3223.6538 3225.4487 3229.9726 3231.5298 3231.6426
redmass: 5.4130 5.2725 5.3088 4.9276 7.4598 4.1636 5.0724 5.7077 5.1052 4.5504 4.2137 3.9803 4.5111 6.6606 7.1740 9.8497 5.4121 4.3667 5.8171 5.4623 4.2092 3.6884 1.0948 1.0856 1.1448 5.3825 4.9468 2.6463 2.5108 2.7941 6.1711 2.8365 2.8879 4.0668 1.4215 3.3119 2.8568 2.4532 8.4278 7.2928 4.3532 15.1227 5.6583 2.7724 4.3172 2.9119 2.8937 4.3316 4.7481 4.9769 5.2908 4.4788 4.8864 3.1848 3.7158 3.8738 3.8335 2.8754 5.4497 4.6529 5.7815 4.2632 4.5594 4.2842 6.3901 6.4245 6.3993 3.8524 5.9835 3.7821 4.8172 4.1793 1.6324 1.6813 4.7957 2.1370 3.9761 6.3969 2.1250 3.5069 1.9104 1.8290 1.3741 3.1651 4.6532 1.2692 1.2697 2.1408 2.3452 1.2420 1.6294 1.3920 1.3239 2.4020 1.4160 2.1397 1.3567 1.6286 1.6666 2.6577 1.4174 1.5314 5.3935 1.5164 4.9688 2.1196 2.9210 2.4002 1.3255 1.3970 1.3519 1.3593 1.3811 3.0512 1.5094 2.4917 2.5527 4.6304 2.6083 1.7658 1.4479 1.9998 1.5237 1.5139 3.0411 3.0887 3.0543 2.7568 4.5636 1.5915 2.3082 1.0922 2.3126 1.0993 1.1005 1.1227 1.1173 1.1162 1.1162 3.0754 2.3625 2.3177 1.5838 2.5036 3.2907 1.5703 2.2160 1.6674 1.7647 1.6637 1.5431 7.3229 3.2161 3.3604 3.8110 1.5647 1.4639 1.4613 1.4680 2.0052 2.0587 1.1048 1.0745 1.1256 1.0968 1.0775 1.0785 2.0437 1.0696 1.0606 2.2012 1.0725 1.0657 2.2793 2.3656 2.4393 2.2386 2.2709 2.2670 6.4681 5.8740 5.9375 6.0585 6.1125 6.0631 6.0563 6.1037 1.0355 1.0361 1.0602 1.0366 1.0375 1.0638 1.1094 1.1041 1.1050 1.0902 1.1035 1.1062 1.1042 1.0930 1.1055 1.1057 1.0862 1.1059 1.1062 1.0918 1.0873 1.0867 1.0873 1.0938 1.0920 1.0917 1.0921 1.0931 1.1003 1.0961 1.0969 1.0961 1.1007 1.1007 1.1001
irintensity: 0.1270 0.0961 0.3244 0.0606 2.2814 0.0164 0.0591 0.9555 0.4600 0.4857 1.2472 0.2963 0.3314 2.7198 0.8205 0.3623 0.8534 0.5092 0.2339 2.9025 2.9324 2.2957 0.2729 0.5762 1.0646 5.5147 2.0361 1.8038 0.5905 0.3147 2.6078 0.8958 1.9588 0.5373 1.7116 1.8816 4.4681 4.7872 4.3728 0.4722 2.4239 21.0888 3.3354 0.0621 1.5749 0.4718 0.5874 6.7844 5.0117 4.3961 4.9858 13.7240 11.3395 7.7423 12.8320 12.2961 6.8302 5.4377 37.9103 43.8014 52.9340 5.3855 16.2136 37.8652 0.2493 0.5368 0.3833 3.2108 7.1258 5.9331 10.2404 13.2894 6.8709 57.8342 19.2731 29.5660 8.7435 6.1324 41.3326 4.9540 5.2209 12.9143 14.9992 12.6038 7.9099 0.2898 0.3211 3.2833 14.3695 0.3231 0.5890 1.3337 0.3437 31.7656 0.5413 10.8104 0.1546 8.2551 4.8036 19.6154 0.0458 1.1952 9.9237 13.8814 1.4017 30.2255 16.2560 31.5923 0.1249 0.3022 0.1525 0.5193 0.1377 7.0615 2.0360 2.0911 2.9002 1.3191 0.7985 2.1420 0.1148 4.5945 1.9827 0.3886 18.5790 11.9675 23.1379 46.3398 73.3134 5.3628 55.1506 0.1027 120.6516 0.4867 0.7007 0.2270 0.5732 4.8069 1.3604 16.6869 105.2060 56.2233 10.9958 47.7484 182.1644 28.0518 11.1972 2.7018 4.1461 2.8738 1.7440 0.2090 1.3010 0.2624 0.4802 6.9544 6.2694 22.6306 18.8886 82.9317 94.5139 5.2420 3.9370 3.8218 3.8952 2.7096 3.5612 4.2986 4.2844 0.4334 12.5361 5.0545 1.2393 16.9601 11.5962 14.0387 20.8407 5.4318 8.6992 0.5661 2.1598 2.1796 27.1610 5.0822 0.5754 0.0839 0.4223 16.2941 7.4747 38.5094 6.2795 16.1227 16.6600 13.1154 0.9295 14.5641 1.5153 15.9129 1.9442 7.3359 0.9634 10.4728 5.1989 0.8889 4.7376 4.3481 9.6517 0.2360 0.2630 0.0981 16.4118 8.2448 1.9359 6.7988 3.4013 29.3207 7.4872 7.6898 2.1469 14.8102 9.1318 18.7553
temp: 298.150 k
press: 1.00000 atm
elementType: 6 6 6 6 1 1 6 6 6 6 1 6 6 1 1 1 15 6 6 6 6 1 6 1 6 1 1 1 6 6 6 6 1 6 1 6 1 1 1 15 6 1 1 1 6 1 1 1 8 6 1 1 6 8 6 1 1 1 8 6 1 1 1 28 6 6 6 6 1 6 1 6 1 1 1 17
symmnumber: 1
zpe: 1620563.8 jmol-1
zpe.correction: 0.617240 hartree
zpe.thermalcorrener: 0.654839 hartree
zpe.thermalcorrenthalpy: 0.655783 hartree
zpe.thermalcorrgfe: 0.548610 hartree
zpe.sumelectzpe: -4191.004539 hartree
zpe.sumelectthermal: -4190.966940 hartree
zpe.sumelectthermalent: -4190.965996 hartree
zpe.sumelectthermalfe: -4191.073170 hartree
dipole: -1.0839 -8.4294 2.6256
dipole: 8.8952
quadrupole: -249.1602 -271.0158 -254.9780
quadrupole: 1.4050 0.7041 4.0970
quadrupole: 9.2245 -12.6311 3.4067 1.4050 0.7041 4.0970
hfenergy: -4191.6217794 hartree
pointgroup: C01 [X(C34H35Cl1Ni1O3P2)]
dipole: -0.4264336 -3.3163991 1.0329879 debye
polarizability: 497.1031337|-26.9114546|412.32208|-12.6407684|0.8003678|400.7106907 unknown
InChI: InChI=1/C28H30O3P2.C6H5.ClH.Ni/c1-25-19-27(3)31-26(2,29-25)20-28(4,30-25)33(27)24-18-12-11-17-23(24)32(21-13-7-5-8-14-21)22-15-9-6-10-16-22;1-2-4-6-5-3-1;;/h5-18H,19-20H2,1-4H3;1-5H;1H;/q;;;+1/p-1/rC34H35ClNiO3P2/c1-31-24-33(3)39-32(2,37-31)25-34(4,38-31)41(33)30-23-15-14-22-29(30)40(27-18-10-6-11-19-27,28-20-12-7-13-21-28)36(41,35)26-16-8-5-9-17-26/h5-23H,24-25H2,1-4H3
charge 0 multiplicity 1
76 atoms
C  2.50045736 -0.02372852 1.28394847
C  3.06605067 -0.159994 -1.4053582
C  3.63625967 1.24362303 -1.19106713
C  4.17199063 1.37427007 0.23453935
H  4.47765695 1.38196943 -1.88740428
H  2.86715435 2.0024266 -1.39772494
C  0.92511656 -1.97225001 -0.32369321
C  1.7004751 -3.11333797 -0.57903554
C  -0.44521493 -2.11845504 -0.04821802
C  1.12107288 -4.37744604 -0.53018299
H  2.75639741 -2.99691663 -0.82775087
C  -1.01491202 -3.39492069 0.0087277
C  -0.23317989 -4.52150351 -0.22306891
H  1.73119031 -5.25938905 -0.73659097
H  -2.08127528 -3.50646218 0.21912303
H  -0.68447982 -5.5150278 -0.18327007
P  -1.4518126 -0.5768209 0.07775214
C  -2.68271716 -0.85120327 -1.24721641
C  -3.87868609 -1.54705 -1.04731803
C  -2.36318044 -0.37452867 -2.52477996
C  -4.74223674 -1.77284326 -2.11808707
H  -4.1472289 -1.90533026 -0.05056562
C  -3.22571425 -0.60773192 -3.59247914
H  -1.44686488 0.20508088 -2.67619915
C  -4.41535693 -1.30727368 -3.39075945
H  -5.67780963 -2.31197457 -1.95484317
H  -2.97167659 -0.22883641 -4.58446287
H  -5.0948876 -1.482784 -4.22758725
C  -2.36399924 -0.71900846 1.64889792
C  -3.49927666 0.07960744 1.85166507
C  -1.9068235 -1.53545139 2.68996534
C  -4.16415151 0.05138101 3.07402792
H  -3.86241736 0.73422411 1.05597924
C  -2.57365516 -1.55658587 3.9140181
H  -1.02760388 -2.16782045 2.54846656
C  -3.70293288 -0.76363251 4.10749284
H  -5.0434502 0.68186435 3.21921878
H  -2.20749022 -2.19805937 4.71828146
H  -4.22474869 -0.77965377 5.06681388
P  1.53750025 -0.24198148 -0.32763454
C  2.71726792 -0.42304178 -2.85604901
H  2.28186224 -1.42414099 -2.99000293
H  1.99423931 0.33755691 -3.18672424
H  3.62705107 -0.3522743 -3.47058754
C  1.56577717 0.02443809 2.47514797
H  1.05493914 -0.94058438 2.60436145
H  2.14173527 0.24593678 3.38582884
H  0.80705711 0.80802843 2.33869336
O  3.13174696 1.24282913 1.19162701
C  3.57122098 -1.10532203 1.40850433
H  4.08559946 -0.97584931 2.37333562
H  3.1305829 -2.11114671 1.38743019
C  4.61169272 -0.93147094 0.29382771
O  4.03039369 -1.12388902 -0.98699733
C  5.75738937 -1.91147384 0.39176192
H  6.27753045 -1.78409764 1.35003089
H  5.38288163 -2.94125097 0.31398227
H  6.46094803 -1.72009123 -0.4288262
O  5.14391067 0.36327728 0.41973939
C  4.82949108 2.70563696 0.50345249
H  5.20493486 2.71907457 1.53510455
H  5.6676004 2.85660157 -0.18911997
H  4.09486249 3.51063961 0.37212679
Ni -0.24221041 1.11051504 -0.45062825
C  -1.74837756 2.17861927 -0.00767909
C  -2.81268732 2.55820724 -0.83280561
C  -1.72010017 2.68884767 1.29825546
C  -3.83097826 3.38863836 -0.36111777
H  -2.85414403 2.20345296 -1.86512519
C  -2.72448003 3.53463129 1.77109173
H  -0.90954303 2.41453874 1.9825361
C  -3.79381632 3.87805537 0.94520609
H  -4.65617104 3.66291295 -1.02380393
H  -2.67560087 3.91772341 2.79379876
H  -4.58916281 4.53058978 1.31331935
Cl 0.53047486 2.61262723 -1.85573886
