program: Gaussian 16
title: opt/freq MN15/Def2-SVP//r2SCAN-3c/Def2-mSVP
version: ES64L-G16RevC.01
frameworkgroup: C1[X(C14H19NO5)]
method: RMN15
basis: def2SVP
operation: Freq
keyword: #N
keyword: Geom=AllCheck
keyword: Guess=TCheck
keyword: SCRF=Check
keyword: GenChk
keyword: RMN15/def2SVP
keyword: Freq
converged: YES YES NO YES
title: Mulliken charges:
elementType: C C H H H C C H H H H H H O C O N H C H C H H C C C C H C H C H H C O O H O H
charge: 0.090256 -0.181326 0.008549 0.014772 0.014776 0.103111 0.086563 0.005612 0.034938 0.003129 0.005088 0.041670 0.009686 -0.288063 0.218613 -0.248508 -0.159401 0.143908 -0.001246 0.051871 0.155167 0.014673 -0.011856 -0.026434 0.016838 0.005854 -0.026968 -0.031459 -0.011725 -0.034614 0.132102 -0.046205 -0.022289 0.114413 -0.200435 -0.170793 0.199306 -0.190516 0.180945
chargesum: -0.00000
title: Mulliken charges with hydrogens summed into heavy atoms:
elementType: C C C C O C O N C C C C C C C C C O O O
charge: 0.128353 -0.181326 0.146789 0.143006 -0.288063 0.218613 -0.248508 -0.015493 0.050625 0.157984 -0.026434 -0.014621 -0.028760 -0.073173 -0.034014 0.132102 0.114413 -0.200435 0.028513 -0.009572
chargesum: 0.00000
1716.lowfreq: -7.1445 -2.3789 -0.0013 -0.0006 0.0008 4.1416 13.2449 37.5659 43.9608
frequency: 12.8468 37.5546 43.9583 53.9793 62.2024 66.7858 96.0074 104.1452 128.6404 140.6204 190.4506 210.6679 219.2147 256.9001 276.5815 281.1686 298.7709 311.1488 338.6254 348.3105 363.3741 380.1120 410.4204 413.8517 424.4766 425.9106 447.2990 453.7979 474.4726 495.1435 550.8273 562.9738 597.1879 637.8648 647.7097 725.3168 742.5348 763.5752 785.5627 786.7496 798.3000 830.8401 853.0161 874.2406 894.1814 913.2559 920.0468 924.5091 934.9335 968.4169 988.4372 992.3117 1009.7838 1018.3632 1024.6760 1025.9416 1096.5520 1103.0774 1158.6984 1161.7077 1167.1348 1178.2471 1208.8022 1215.8349 1225.1721 1248.0701 1264.0689 1275.3646 1276.9755 1309.2724 1332.2558 1349.7613 1355.7489 1365.2357 1370.6984 1380.6978 1385.6907 1410.1717 1431.4651 1434.3630 1435.5384 1441.3759 1443.7458 1449.2388 1470.3064 1476.2872 1551.7467 1575.5911 1675.2867 1713.6753 1848.3675 1905.9381 3077.8204 3078.3897 3081.8000 3082.0042 3117.6378 3155.6418 3170.3743 3173.6310 3181.7907 3185.5316 3201.6909 3204.0113 3213.2844 3214.6992 3220.6178 3245.7652 3657.6815 3818.8590 3893.9960
redmass: 4.2668 7.0564 3.2957 7.3256 5.2742 4.5873 4.6469 5.1549 3.6058 5.6971 5.4258 1.5920 2.2103 1.1234 3.2534 1.1140 3.2961 2.8791 4.3041 2.5255 2.7302 1.3240 2.8936 3.0846 3.0421 2.8774 2.8616 2.9623 1.2382 4.1222 2.5262 3.2947 1.3193 6.5156 3.4811 3.5756 3.4474 5.2139 5.2423 6.2300 4.0064 1.3117 1.7516 5.0715 2.1353 2.2910 1.5132 1.6389 1.2051 1.5516 1.9526 1.5134 2.3238 2.3233 1.4166 1.4956 2.3965 1.6157 1.1031 1.2628 1.3755 1.9131 1.4730 2.1358 1.7044 1.9142 2.1369 2.1125 1.8367 1.3214 1.9401 2.6952 2.1818 1.5624 1.6727 1.3115 5.2171 1.0442 1.0589 1.2377 1.0557 1.3527 2.4447 1.0858 1.0882 3.3992 3.5625 4.0031 7.1493 7.4508 11.6444 11.2650 1.0362 1.0375 1.0592 1.0431 1.0845 1.1035 1.1042 1.1040 1.1050 1.1046 1.0888 1.1038 1.1032 1.0904 1.0964 1.0953 1.0783 1.0644 1.0660
irintensity: 0.4444 0.6145 0.2259 1.6354 1.8851 1.0996 0.6453 1.1255 4.2100 2.0156 0.2053 4.2581 6.2158 0.0428 1.8744 0.2423 3.6701 1.7330 7.7687 4.5211 12.9933 95.0413 4.5795 7.1845 8.8812 2.9155 11.6118 0.8852 79.8876 1.8184 22.8630 5.6913 94.5530 0.0301 65.6638 18.0676 10.2199 6.0883 20.2409 29.0153 16.0219 5.9696 32.2809 1.8812 3.7496 17.0791 1.0690 3.2519 0.2616 0.7592 1.0547 0.9162 0.1967 1.5768 0.3417 2.6188 45.5292 44.3286 19.0569 112.7766 19.0462 203.9740 112.8779 72.7589 3.9833 14.0205 8.1083 91.4253 17.2044 32.4478 16.7989 65.2123 45.9609 30.5650 30.5460 42.6138 11.4863 0.5660 0.1982 19.5825 0.7846 164.0502 289.1545 1.6270 16.3384 9.4188 427.1636 193.0302 13.1319 69.2526 235.1182 286.1415 8.6135 19.1550 36.4769 6.6300 4.3613 9.8122 9.5008 18.7157 19.9333 26.2342 16.7489 3.5910 3.5288 9.0397 9.4374 3.9836 83.4453 131.3986 92.2490
temp: 333.150 k
press: 1.00000 atm
elementType: 6 6 1 1 1 6 6 1 1 1 1 1 1 8 6 8 7 1 6 1 6 1 1 6 6 6 6 1 6 1 6 1 1 6 8 8 1 8 1
symmnumber: 1
zpe: 844601.7 jmol-1
zpe.correction: 0.321692 hartree
zpe.thermalcorrener: 0.346783 hartree
zpe.thermalcorrenthalpy: 0.347838 hartree
zpe.thermalcorrgfe: 0.262215 hartree
zpe.sumelectzpe: -973.617030 hartree
zpe.sumelectthermal: -973.591939 hartree
zpe.sumelectthermalent: -973.590884 hartree
zpe.sumelectthermalfe: -973.676507 hartree
dipole: 0.6635 0.7763 -0.5972
dipole: 1.1830
quadrupole: -101.3899 -117.2902 -116.6379
quadrupole: 3.1540 1.6065 -5.0792
quadrupole: 10.3827 -5.5175 -4.8652 3.1540 1.6065 -5.0792
hfenergy: -973.938722 hartree
pointgroup: C01 [X(C14H19N1O5)]
dipole: -0.1204419 0.3961226 0.2126246 debye
polarizability: 198.4413172|-12.7123379|152.8890401|7.0941716|15.7679107|142.8554923 unknown
InChI: InChI=1S/C14H19NO5/c1-14(2,3)20-13(19)15-11(12(17)18)8-9-4-6-10(16)7-5-9/h4-7,11,15-17H,8H2,1-3H3
charge 0 multiplicity 1
39 atoms
C  1.09126538 -4.09024365 -0.84102959
C  1.00819897 -2.96294379 0.17935165
H  1.923395 -4.7647157 -0.59272497
H  0.15619033 -4.66898515 -0.84799239
H  1.25629129 -3.68047604 -1.84795525
C  2.28458433 -2.12826582 0.15739941
C  0.7144986 -3.52335693 1.56742959
H  2.45632347 -1.72500961 -0.85185811
H  2.21794275 -1.290065 0.86307533
H  3.14190928 -2.76234473 0.4288476
H  1.50955337 -4.22828219 1.85306502
H  0.66347342 -2.71913717 2.31124552
H  -0.24195882 -4.06783886 1.55892255
O  -0.11163091 -2.17209209 -0.28977129
C  -0.49932309 -1.06698157 0.3604205
O  -0.00778413 -0.63430724 1.38452388
N  -1.54793099 -0.47904359 -0.28804637
H  -1.99231763 -0.95499583 -1.06860484
C  -2.10056614 0.75949444 0.17957214
H  -1.90161607 0.83567751 1.26133003
C  -1.48151765 2.00342801 -0.5107751
H  -1.88430866 2.90365935 -0.02297501
H  -1.81326895 2.01719314 -1.56227259
C  0.02039339 1.96324865 -0.44494836
C  0.70499898 2.39653011 0.69437457
C  0.76360471 1.37222608 -1.47538938
C  2.08310829 2.23263935 0.81289973
H  0.14737147 2.84911568 1.51951723
C  2.14152651 1.20415946 -1.37235299
H  0.24655086 1.02312617 -2.37389911
C  2.80922633 1.62382961 -0.21667456
H  2.60283026 2.56534433 1.71682231
H  2.72255625 0.74166887 -2.17258893
C  -3.59542701 0.74831869 -0.04588194
O  -4.18639984 -0.07592791 -0.69913047
O  -4.19611853 1.80036839 0.52078364
H  -5.14278662 1.75208401 0.29899486
O  4.1454629 1.41775826 -0.14053816
H  4.47932691 1.73543355 0.70920832
