program: Gaussian 16
title: S_TS1_boc L Na
version: ES64L-G16RevC.01
method: RMN15
basis: GenECP
operation: Freq
keyword: #N
keyword: Geom=AllCheck
keyword: Guess=TCheck
keyword: SCRF=Check
keyword: GenChk
keyword: RMN15/GenECP
keyword: Freq
converged: YES YES NO YES
title: Mulliken charges:
elementType: C C C C C C H H H H C C H H H C C C C H C H C H H C H H H C O O C H H H Pd O C O N C O O Na C C H H H C H H H C H H H C H C H H C C C C H C H C H H O H
charge: -0.013267 0.004600 0.053378 -0.010629 -0.005113 -0.046077 -0.038720 -0.036937 -0.004594 -0.038179 -0.195836 0.083573 0.024880 0.008616 0.033011 0.034405 -0.062378 0.035000 0.014694 0.260520 -0.013707 -0.019013 -0.024068 -0.065743 -0.032260 0.145462 0.014847 0.038155 0.030369 0.190749 -0.357987 -0.269712 0.099472 0.034542 -0.002218 0.024755 0.049647 -0.436798 0.231202 -0.231723 -0.303170 0.326797 -0.300868 -0.267006 0.612255 -0.187923 0.106413 0.035727 0.004837 0.008390 0.094688 0.013459 0.042245 0.007411 0.100089 0.010199 0.003759 0.016780 -0.004135 0.027885 0.170030 0.004119 0.017907 -0.004687 0.006379 -0.010771 -0.033605 -0.017627 -0.007790 -0.024668 0.129318 -0.054439 -0.018458 -0.192080 0.181623
chargesum: -0.00000
title: Mulliken charges with hydrogens summed into heavy atoms:
elementType: C C C C C C C C C C C C C C C C O O C Pd O C O N C O O Na C C C C C C C C C C C C O
charge: -0.051986 -0.032337 0.053378 -0.015223 -0.043292 -0.046077 -0.195836 0.150080 0.034405 0.198142 0.015986 -0.051049 -0.045967 -0.024068 0.228833 0.190749 -0.357987 -0.269712 0.156551 0.049647 -0.436798 0.231202 -0.231723 -0.303170 0.326797 -0.300868 -0.267006 0.612255 -0.187923 0.155365 0.157803 0.130828 0.023750 0.192056 -0.004687 -0.011248 -0.035439 -0.088045 -0.026248 0.129318 -0.010458
chargesum: 0.00000
1716.lowfreq: -1220.3494 -3.9469 -0.0011 -0.0005 -0.0001 2.8670 3.8406 14.3744 22.3208
frequency: -1220.3494 14.2622 22.3075 24.1578 27.3598 34.0359 39.3349 46.6098 51.5930 53.9428 58.0936 60.5113 65.9459 68.0223 74.0571 84.0048 94.6697 96.5082 105.7486 117.9351 133.1803 136.3999 158.8708 161.1034 166.9931 178.5831 181.7253 193.3505 213.7100 222.9767 226.4056 236.0236 239.5133 252.3532 256.4638 258.7563 264.2164 283.9445 286.0572 313.7721 319.0367 320.0863 329.5031 348.0870 351.8480 354.4475 360.9960 368.6961 375.8651 381.2820 398.3284 408.8117 417.6341 418.7414 422.1159 426.8899 437.5332 437.8214 442.5807 453.1740 459.3254 469.2990 488.2389 504.4926 524.7111 531.3441 550.7378 563.9321 584.4512 615.3889 637.6144 637.6911 658.4193 670.7833 707.2329 730.0252 732.7045 739.4780 759.5187 763.8646 771.5643 776.0066 783.9759 807.6823 813.0985 824.2290 833.8420 844.6277 856.5351 859.0997 861.5435 869.4534 878.4426 881.9524 895.2982 918.2010 921.9496 924.6381 925.6172 933.6031 939.3217 970.1581 980.7195 985.4480 987.5118 992.3524 999.2841 1011.3577 1013.3722 1016.6895 1018.9232 1026.1623 1028.8568 1030.2006 1035.1284 1045.4754 1046.6216 1079.3473 1096.9814 1098.5336 1119.8150 1126.3190 1145.8201 1148.9369 1157.0536 1159.8308 1176.6481 1182.6531 1188.3531 1211.3119 1216.9347 1221.6803 1237.3678 1242.4964 1247.8478 1252.4637 1265.7450 1267.5140 1275.1113 1276.4636 1304.5950 1306.1069 1309.2443 1326.4942 1338.1373 1349.0111 1354.7049 1362.8595 1363.2891 1366.5823 1369.6624 1376.1144 1378.5000 1378.8052 1380.3132 1385.4550 1400.1010 1410.3036 1421.5934 1428.9735 1431.4737 1432.1925 1433.0779 1435.1402 1435.2861 1440.4857 1440.9536 1446.5849 1449.6377 1450.2729 1459.6604 1468.8446 1472.1136 1520.4228 1555.1421 1564.8473 1573.8568 1631.7726 1657.8940 1671.0326 1681.1673 1704.2333 1709.7054 1720.1926 1741.6111 1867.2340 3070.8639 3073.0129 3073.3458 3074.2333 3079.3572 3080.2543 3083.5994 3131.4607 3150.5969 3155.9511 3157.6386 3168.7592 3172.7662 3172.8705 3175.5640 3181.0692 3184.5605 3190.3698 3191.7997 3193.3061 3196.6265 3202.7487 3204.4314 3209.8964 3210.5679 3213.5316 3214.6756 3216.8284 3218.7492 3242.5738 3243.9584 3249.6880 3894.6852
redmass: 1.1403 5.0855 5.8740 5.6496 5.5307 1.1137 4.6692 1.1492 4.1704 4.5479 3.0118 4.4352 5.4627 3.6212 4.4408 4.7872 4.3508 5.5457 5.5274 7.3138 6.2145 6.1363 3.4979 5.5274 4.0112 6.6815 7.2245 8.4912 2.4881 2.4620 4.3529 2.4999 3.6992 3.2338 2.3433 2.9841 3.4796 1.1487 3.9608 2.7219 2.5579 3.9040 2.5835 2.6055 1.7967 2.6983 3.3455 2.9659 1.4536 3.4825 4.2776 6.7942 3.4557 3.3860 2.9342 3.0053 6.8159 4.6606 4.1129 2.8681 3.4964 4.8384 6.1360 4.2398 3.9670 3.8997 3.4325 2.7582 3.9021 4.3527 6.4031 6.4314 4.5474 6.4978 4.5012 4.9289 4.1718 3.9566 3.6210 5.7464 6.7153 3.2085 4.4602 4.6343 3.9112 3.9837 1.4695 2.6246 2.2990 1.8465 1.4965 1.3041 3.5381 3.0449 2.8600 2.4493 1.5037 1.4461 1.5700 1.8875 1.2052 1.7880 1.3964 1.5453 2.0150 1.3821 1.3781 1.9574 1.5499 2.3298 1.5228 1.4221 1.9445 1.6885 3.1026 1.6293 1.6219 1.9237 1.4411 2.0531 1.4036 3.4309 1.5563 1.9020 1.1001 1.2554 1.4918 1.0983 1.4572 1.8132 1.8309 1.7153 1.9921 1.8866 2.6003 1.7749 1.9303 2.1207 2.1196 3.5193 1.2949 1.3224 1.4234 2.6298 2.4526 2.5777 2.2660 5.3583 1.9654 1.5339 1.6731 2.6565 1.5496 1.4422 1.3705 4.0364 5.0813 1.0446 1.7044 1.4704 1.1529 1.0738 1.0462 1.0508 1.0526 1.1161 1.0895 1.1160 1.0944 1.4664 1.9091 1.3226 2.1493 3.6523 3.2765 7.8274 4.2396 6.7463 7.2568 7.1220 7.0840 7.2111 7.4408 7.3836 11.6171 12.7953 1.0379 1.0384 1.0650 1.0359 1.0366 1.0368 1.0384 1.0864 1.1016 1.1025 1.1028 1.1037 1.1041 1.1044 1.1039 1.1042 1.1049 1.1047 1.0895 1.1054 1.0909 1.0883 1.1041 1.0906 1.0907 1.0909 1.0952 1.1029 1.0968 1.0935 1.0950 1.0933 1.0660
irintensity: 2917.8912 0.3345 0.1547 1.1632 0.5264 0.3627 0.4888 0.5542 0.4525 0.2134 0.3236 1.6845 5.4728 0.8283 0.2141 1.3496 0.9337 3.2273 2.1799 7.3252 0.4688 1.8170 2.3602 2.5498 4.0925 9.2018 7.8306 6.8754 3.9787 8.6736 3.9384 3.3008 19.2449 1.5446 11.3098 4.0764 2.7131 0.5729 5.3478 3.3565 2.0794 15.7238 17.7011 5.4423 0.7976 8.1478 7.9818 13.3536 78.6033 10.5360 4.4864 53.9134 15.6605 10.2510 0.0724 0.4004 25.6088 4.1139 10.3611 5.9351 11.0904 24.4448 42.4469 13.7275 6.8607 1.2411 15.0897 24.1026 7.6502 9.3906 0.2226 0.4849 19.8595 9.3241 14.0119 7.4789 4.6482 1.7721 6.0267 11.5747 24.7164 24.9496 14.0439 2.8417 11.1894 41.0599 9.3483 3.5448 26.3880 27.0024 3.4269 1.0741 12.6341 16.3538 0.7519 11.2472 1.6682 10.9770 1.6443 2.9770 0.2521 9.8185 3.2126 2.8521 18.7056 5.1913 1.5964 1.2695 0.4289 11.4413 1.5630 0.2143 4.2017 0.4454 23.9267 4.6524 4.2268 38.5314 5.4020 25.1796 7.1493 18.4851 0.7019 6.1629 5.6066 181.8870 422.1332 8.0747 387.2665 36.7805 60.2253 10.0744 16.9294 11.8009 3.7494 75.5072 18.0347 10.0553 10.7036 15.9356 2.4600 10.8465 24.1852 166.3615 72.7640 25.9552 57.2052 16.0505 20.8939 21.8159 141.4393 331.3252 50.2589 20.6209 29.8884 149.4359 118.2650 0.5654 37.1925 2.3138 12.6654 2.3645 3.1692 6.4884 0.6314 10.2780 4.7252 8.5687 0.2968 1.2746 8.1117 0.8788 7.2061 53.1605 38.9493 346.0146 276.9843 7.7215 1.9270 15.9248 1.0318 5.7674 65.6403 465.6235 431.2259 702.4361 29.4571 33.5161 15.7599 7.0984 10.2319 7.2687 24.6707 3.2887 13.4144 10.8402 9.0479 12.9127 8.9356 13.5567 9.8973 12.0233 16.9566 14.0721 18.3853 5.4272 1.7979 10.5585 3.8975 13.4541 6.1150 18.2736 8.2029 3.6748 9.1456 4.9244 4.2632 5.2593 80.1931
temp: 333.150 k
press: 1.00000 atm
elementType: 6 6 6 6 6 6 1 1 1 1 6 6 1 1 1 6 6 6 6 1 6 1 6 1 1 6 1 1 1 6 8 8 6 1 1 1 46 8 6 8 7 6 8 8 11 6 6 1 1 1 6 1 1 1 6 1 1 1 6 1 6 1 1 6 6 6 6 1 6 1 6 1 1 8 1
symmnumber: 1
zpe: 1556918.4 jmol-1
zpe.correction: 0.592999 hartree
zpe.thermalcorrener: 0.643433 hartree
zpe.thermalcorrenthalpy: 0.644488 hartree
zpe.thermalcorrgfe: 0.501830 hartree
zpe.sumelectzpe: -2068.950432 hartree
zpe.sumelectthermal: -2068.899998 hartree
zpe.sumelectthermalent: -2068.898943 hartree
zpe.sumelectthermalfe: -2069.041601 hartree
dipole: 2.1253 2.7035 -0.3143
dipole: 3.4532
quadrupole: -243.4180 -239.3911 -247.8120
quadrupole: -15.7892 -10.7802 -3.2203
quadrupole: 0.1223 4.1493 -4.2716 -15.7892 -10.7802 -3.2203
hfenergy: -2069.543431 hartree
pointgroup: C01 [X(C31H34N1Na1O7Pd1)]
dipole: -0.8363326 -1.0632501 -0.125716 debye
polarizability: 517.9540932|17.7130998|385.492458|12.1734493|12.935315|309.8267723 unknown
InChI: InChI=1/C17H17O2.C14H17NO5.Na.Pd/c1-12-4-8-14(9-5-12)17(3,16(18)19)15-10-6-13(2)7-11-15;1-14(2,3)20-13(19)15-11(12(17)18)8-9-4-6-10(16)7-5-9;;/h4-11H,1-3H3;4-7,11,16H,8H2,1-3H3;;/q2*-1;2*+1/rC31H34NNaO7Pd/c1-19-7-12-22(13-8-19)30(6)24-16-9-20(2)17-26(24)41-32(28(36)37-29(3,4)5)25(18-21-10-14-23(34)15-11-21)27(35)39(41)33(41)31(30,38-33)40(33)41/h7-17,25-26,34H,18H2,1-6H3
charge 0 multiplicity 1
75 atoms
C  -6.68325695 -0.94340881 1.4566889
C  -5.31782191 -0.6955021 1.63752804
C  -4.50673497 -0.3519553 0.55622885
C  -5.10297991 -0.25803202 -0.71304551
C  -6.46016151 -0.50167362 -0.88853953
C  -7.27998494 -0.85038301 0.19754922
H  -7.29752587 -1.21319477 2.3205354
H  -4.89621177 -0.77523852 2.6406786
H  -4.47696232 -0.00031358 -1.57366265
H  -6.89830329 -0.42252981 -1.88781325
C  -3.00521109 -0.08947139 0.68246705
C  -8.751432 -1.09903623 0.00208149
H  -8.93099667 -1.82523269 -0.80509198
H  -9.217935 -1.48568681 0.91870825
H  -9.27680869 -0.17181071 -0.27590822
C  -2.17338804 -1.18051173 -0.00138127
C  -0.77742386 -1.00532571 -0.18175527
C  -2.74111982 -2.38319384 -0.43139287
C  -0.02440189 -2.01492753 -0.80800186
H  0.03588422 -0.59715641 0.7768319
C  -1.96766746 -3.37115651 -1.04840322
H  -3.80873507 -2.56084407 -0.28955274
C  -0.59441729 -3.20663151 -1.2624179
H  1.05816318 -1.86796314 -0.89251489
H  -2.45176364 -4.29916903 -1.3677567
C  -2.55147645 0.0478694 2.14254249
H  -2.68574828 -0.90030725 2.68275603
H  -1.48249116 0.30950365 2.18335319
H  -3.1260123 0.84324892 2.63677598
C  -2.79450739 1.2788163 0.00366714
O  -2.16005439 1.30196869 -1.13437405
O  -3.23819225 2.30698229 0.52437311
C  0.22931555 -4.26637169 -1.94285147
H  -0.01877769 -4.33788601 -3.01345197
H  1.30310658 -4.04198456 -1.86357664
H  0.05412627 -5.25896312 -1.5017559
Pd -0.22959463 0.98892744 -0.52634089
O  0.22599681 2.92206797 -0.92063814
C  1.4891817 3.2596154 -0.73688303
O  1.91456118 4.38169983 -0.89733005
N  1.60995909 0.99117562 0.13105971
C  1.90471452 0.2638028 1.19799329
O  1.08613616 -0.57688606 1.66786757
O  3.09168049 0.47819936 1.75004951
Na -1.87659768 3.61534853 -0.85126529
C  3.64294169 -0.3674044 2.79705723
C  3.74166835 -1.80128575 2.29042863
H  2.74570377 -2.24371316 2.16189357
H  4.27248777 -1.81464521 1.32589999
H  4.31141107 -2.40721295 3.01045228
C  2.80844515 -0.25139811 4.06703011
H  2.71195925 0.80467165 4.36064362
H  1.80867385 -0.67815371 3.92406118
H  3.3144152 -0.78991844 4.88219991
C  5.03081862 0.21916158 3.01438615
H  5.55645744 -0.33959286 3.80189208
H  5.61440291 0.15928399 2.08458102
H  4.95585024 1.2734487 3.31807291
C  2.41167372 2.08452521 -0.37848879
H  3.13196564 2.42251102 0.38210516
C  3.17236417 1.692988 -1.66267266
H  2.42338456 1.5193505 -2.45458985
H  3.77878102 2.56017058 -1.96537431
C  4.01583142 0.4592761 -1.49290819
C  3.53173831 -0.79246011 -1.88709323
C  5.28519156 0.51064076 -0.89939708
C  4.28303095 -1.95556763 -1.70516049
H  2.54706055 -0.85347612 -2.36072411
C  6.05054954 -0.63834033 -0.71821193
H  5.68497005 1.47642483 -0.57508757
C  5.55173467 -1.88413662 -1.12082045
H  3.88725261 -2.92502084 -2.02639571
H  7.04328686 -0.59730741 -0.26531347
O  6.32420841 -2.97790819 -0.91805552
H  5.87154407 -3.76719178 -1.2444809
