program: Gaussian 16
title: MN15/BS1
version: ES64L-G16RevC.01
method: RMN15
basis: GenECP
operation: Freq
keyword: #N
keyword: Geom=AllCheck
keyword: Guess=TCheck
keyword: SCRF=Check
keyword: GenChk
keyword: RMN15/GenECP
keyword: Freq
converged: YES YES NO YES
title: Mulliken charges:
elementType: C C C C C C H H H H C C H H H C C C C H C H C H H C H H H C O O C H H H Pd O C O N C O O Na C C H H H C H H H C H H H C H C H H C C C C H C H C H H O H
charge: -0.013692 0.004055 0.056667 -0.009772 -0.005451 -0.045762 -0.039280 -0.037613 -0.006165 -0.039636 -0.192671 0.083700 0.008234 0.032082 0.024889 0.031859 -0.056553 0.033880 0.010307 0.268077 -0.017487 -0.023531 -0.018791 -0.035516 -0.035144 0.143058 0.015849 0.045031 0.030310 0.187652 -0.357922 -0.269201 0.092753 0.017123 0.002472 0.036603 -0.004160 -0.427024 0.198616 -0.229265 -0.299263 0.318129 -0.301282 -0.276771 0.614669 -0.185806 0.090425 0.015733 0.020826 0.013251 0.089700 0.005881 0.012242 0.046174 0.090213 0.046074 0.009489 0.014992 -0.000207 0.042368 0.191651 0.032932 -0.022524 -0.037215 0.009652 -0.010578 -0.008348 0.010989 -0.003179 -0.040585 0.131285 -0.040932 -0.032039 -0.191012 0.184483
chargesum: -0.00000
title: Mulliken charges with hydrogens summed into heavy atoms:
elementType: C C C C C C C C C C C C C C C C O O C Pd O C O N C O O Na C C C C C C C C C C C C O
charge: -0.052972 -0.033558 0.056667 -0.015937 -0.045086 -0.045762 -0.192671 0.148905 0.031859 0.211524 0.010349 -0.025209 -0.052631 -0.018791 0.234248 0.187652 -0.357922 -0.269201 0.148951 -0.004160 -0.427024 0.198616 -0.229265 -0.299263 0.318129 -0.301282 -0.276771 0.614669 -0.185806 0.140235 0.153997 0.160768 0.042161 0.202059 -0.037215 0.020641 -0.051163 -0.049280 -0.035218 0.131285 -0.006529
1716.lowfreq: -1273.8729 -4.0053 -1.9883 0.0006 0.0006 0.0007 1.6794 12.5974 20.0711
frequency: -1273.8729 12.4132 19.8895 23.6563 28.6019 34.6328 35.7274 41.5837 49.2558 54.9393 58.6558 66.4591 77.1998 78.9576 89.3989 100.5451 103.5941 109.1047 125.0695 134.5264 147.6496 156.5548 165.4299 167.9475 171.7427 184.4085 185.7010 198.3093 214.2932 224.2993 231.6164 236.0021 240.0719 250.5301 256.3901 260.0013 266.9342 282.4275 288.3732 317.7951 319.6356 326.3415 345.4397 347.8359 349.6729 354.6982 360.5746 366.0900 372.0189 381.9339 395.9718 403.7692 415.0030 417.8084 421.7736 426.1410 434.7735 436.0810 442.5371 451.9898 454.8447 464.8852 491.8101 517.8683 525.0036 533.8221 552.5848 583.1314 583.4998 615.0185 628.9825 637.5769 644.6911 670.9208 710.1982 725.5631 732.1065 739.9491 749.9076 758.7427 771.9306 775.1091 784.1134 810.6125 812.3977 831.3932 835.2898 843.4925 855.1282 858.4014 860.9936 868.9473 869.5568 893.0721 894.2588 905.2307 916.9795 920.8399 924.5094 927.9993 938.0232 969.9543 980.4247 983.2209 989.8304 991.7837 992.2773 1008.3822 1008.9924 1016.2846 1018.5591 1019.4850 1025.2471 1028.5691 1033.4380 1045.4023 1052.2080 1078.0494 1098.3221 1101.0117 1119.3595 1136.8831 1145.0877 1147.8883 1158.4539 1162.7258 1164.4452 1177.5059 1182.6669 1215.6555 1220.9576 1223.4016 1235.5963 1242.2103 1247.2233 1251.5993 1265.5472 1266.3786 1275.7890 1277.0887 1299.0784 1304.3315 1309.5450 1316.5765 1329.6935 1354.1103 1355.3216 1362.2355 1365.7992 1368.0710 1370.9357 1377.7011 1378.7034 1381.9505 1382.7583 1386.6653 1399.1361 1411.4909 1424.5856 1428.8608 1429.5611 1433.2698 1434.2102 1434.4352 1434.9688 1439.6039 1442.0367 1446.1547 1450.2350 1455.2190 1459.1231 1470.0404 1471.7735 1515.2896 1554.9736 1563.9633 1569.1550 1635.3424 1657.4009 1671.3652 1678.0478 1704.1720 1707.7452 1728.0916 1741.2103 1855.7859 3071.2765 3072.6371 3073.9924 3076.4199 3078.4666 3083.3598 3089.6986 3097.1262 3155.3860 3156.4584 3159.8814 3168.2518 3169.0770 3174.7172 3176.6213 3179.9113 3180.7991 3188.3280 3192.5813 3198.3483 3200.8529 3202.3061 3204.3217 3208.9745 3210.0355 3213.1496 3214.4358 3218.2594 3225.8383 3240.6305 3241.8612 3249.3782 3891.8599
redmass: 1.1314 4.8342 6.0699 5.0991 5.1265 1.8947 1.6444 3.2711 4.3290 3.6829 5.6914 6.3242 5.0090 7.3181 4.8926 5.5950 5.9120 4.5335 7.1389 6.1872 2.8382 2.1776 2.2126 2.5539 6.5089 4.5018 6.2978 7.6884 2.1805 2.6652 5.2828 2.1752 6.1162 3.4705 3.0635 1.8950 3.5418 1.1758 3.8253 2.7821 2.9647 2.3271 2.5326 2.0330 2.1021 2.1177 2.3110 2.2642 3.9486 3.8388 5.7649 4.1640 3.8625 3.2501 2.9729 3.0408 6.6916 4.7429 5.7126 2.8208 3.0535 5.0979 6.1908 3.2660 3.6943 4.3438 3.4361 3.7197 3.8936 4.3350 6.8929 6.6150 5.7787 6.6142 4.5245 3.7152 3.9730 4.1519 3.9807 3.7164 6.6597 3.3082 4.5739 4.5027 3.9373 2.4388 1.3832 2.7501 2.2618 3.9281 1.4719 1.3165 2.7352 3.0919 2.9271 3.0295 2.4594 1.5018 1.5458 1.3674 1.2047 1.8058 1.3971 1.8736 1.3880 1.3799 1.3837 2.4681 1.3959 2.2774 1.5605 2.0615 1.4195 1.4608 3.0650 1.6278 1.6050 1.9238 2.5381 1.2332 1.4124 2.7855 1.3980 2.1523 1.2560 1.1092 1.2693 1.3590 1.0918 2.7709 1.7013 1.7423 1.9369 1.9557 2.5492 2.0841 1.9004 1.8930 2.0917 3.8649 1.7885 1.2967 1.4186 1.6315 3.5049 2.1972 1.8283 4.2807 2.9981 1.5297 1.5694 4.2449 1.4029 1.4226 1.3681 4.2404 4.9951 1.0433 2.1303 1.4913 1.1835 1.0569 1.0525 1.0572 1.0500 1.0648 1.1327 1.1070 1.0864 1.2621 1.8981 1.0914 3.1883 3.7142 3.2735 8.0408 3.9761 6.6184 7.2502 7.0920 7.0896 7.2135 7.3612 8.6157 10.0306 12.8075 1.0378 1.0384 1.0359 1.0379 1.0369 1.0385 1.0727 1.0726 1.1025 1.1062 1.1028 1.1036 1.1034 1.1042 1.1045 1.1049 1.1041 1.1048 1.1055 1.0910 1.0902 1.0882 1.0900 1.1033 1.0904 1.0908 1.1035 1.0968 1.0954 1.0935 1.0947 1.0932 1.0660
irintensity: 2870.5200 0.1563 0.0309 0.4372 0.9373 0.0605 0.5559 0.0399 0.0301 0.2608 1.6218 5.5713 0.3394 2.6421 4.9170 3.5224 0.1766 0.2358 7.5413 0.1786 0.7459 1.8529 2.1373 2.4803 1.5802 3.6357 6.4169 9.4144 2.4108 11.3994 1.8134 10.0733 20.7002 4.9301 3.6832 1.1004 3.5412 0.2694 5.5525 9.4412 5.4003 12.8322 6.7000 9.2567 8.7787 28.5201 30.7935 35.4277 9.6841 15.2311 39.6966 15.5975 33.2678 2.0424 0.7956 1.7788 30.0885 1.4467 7.6112 7.0274 6.7483 12.8270 46.4682 1.9013 5.3458 1.2880 14.1156 31.5848 2.8848 9.1012 2.4802 0.1464 0.8797 5.6506 34.7832 2.3678 10.0854 4.5396 8.1289 4.7133 31.0480 21.6268 15.0331 2.4334 10.8254 42.9767 2.2890 3.0769 22.5015 6.1826 5.7251 0.9516 24.0029 35.0133 7.1176 6.2193 10.2503 0.7527 0.6232 14.0171 0.2343 0.5391 2.8925 6.0004 2.2932 3.6497 4.1358 0.5298 1.3062 11.3227 2.1384 2.1400 0.3136 1.9278 17.3596 4.3962 7.0418 37.0737 23.0625 17.1867 7.3057 41.8320 5.0960 22.8797 162.1806 21.1249 492.1399 217.5211 2.4800 156.6971 18.4272 9.5848 42.2590 13.3879 2.7075 33.6038 5.8067 8.0943 18.6595 9.0032 22.6403 3.4535 36.7580 26.4747 50.7897 77.4212 58.0068 11.8672 1.7546 27.2348 70.9688 171.8417 1.7664 40.2317 6.3146 421.6920 62.4374 0.3779 25.8063 2.6387 9.0727 2.5653 1.9534 4.6981 6.4982 6.2015 9.5940 8.2031 0.5475 12.2881 8.8871 1.3976 9.6990 51.7810 39.7907 545.8193 83.5618 13.5181 2.0293 6.0929 0.5560 5.8444 48.7486 564.4269 431.1511 656.7277 21.4696 34.0878 7.9075 10.3947 15.6897 17.2197 7.0735 25.6723 11.0221 5.3846 7.3392 13.9784 17.3559 14.3279 14.2008 21.7469 12.2714 22.2747 5.8908 4.0803 15.8234 10.6135 6.0196 3.5893 13.8858 18.7835 3.6550 9.1783 2.0957 5.7406 3.4936 5.5115 83.4306
temp: 333.150 k
press: 1.00000 atm
elementType: 6 6 6 6 6 6 1 1 1 1 6 6 1 1 1 6 6 6 6 1 6 1 6 1 1 6 1 1 1 6 8 8 6 1 1 1 46 8 6 8 7 6 8 8 11 6 6 1 1 1 6 1 1 1 6 1 1 1 6 1 6 1 1 6 6 6 6 1 6 1 6 1 1 8 1
symmnumber: 1
zpe: 1557502.2 jmol-1
zpe.correction: 0.593221 hartree
zpe.thermalcorrener: 0.643319 hartree
zpe.thermalcorrenthalpy: 0.644374 hartree
zpe.thermalcorrgfe: 0.503152 hartree
zpe.sumelectzpe: -2068.953658 hartree
zpe.sumelectthermal: -2068.903560 hartree
zpe.sumelectthermalent: -2068.902505 hartree
zpe.sumelectthermalfe: -2069.043727 hartree
dipole: 1.9042 0.2728 0.5429
dipole: 1.9988
quadrupole: -244.1141 -242.8426 -242.3796
quadrupole: 12.4759 -21.0891 -5.2856
quadrupole: -1.0020 0.2695 0.7325 12.4759 -21.0891 -5.2856
hfenergy: -2069.5468791 hartree
pointgroup: C01 [X(C31H34N1Na1O7Pd1)]
dipole: 0.7491893 0.1073153 0.2135814 debye
polarizability: 483.219094|25.3766864|357.15287|8.8926272|18.0914937|352.005698 unknown
InChI: InChI=1/C17H17O2.C14H17NO5.Na.Pd/c1-12-4-8-14(9-5-12)17(3,16(18)19)15-10-6-13(2)7-11-15;1-14(2,3)20-13(19)15-11(12(17)18)8-9-4-6-10(16)7-5-9;;/h4-11H,1-3H3;4-7,11,16H,8H2,1-3H3;;/q2*-1;2*+1/rC31H34NNaO7Pd/c1-19-7-12-22(13-8-19)30(6)24-16-9-20(2)17-26(24)41-32(28(36)37-29(3,4)5)25(18-21-10-14-23(34)15-11-21)27(35)39(41)33(41)31(30,38-33)40(33)41/h7-17,25-26,34H,18H2,1-6H3
charge 0 multiplicity 1
75 atoms
C  6.42953778 -1.2184892 1.02547001
C  5.05739906 -1.49217557 0.99660221
C  4.17771183 -0.65525001 0.3103562
C  4.71258767 0.46277717 -0.35241449
C  6.07641022 0.72976354 -0.32500551
C  6.96503195 -0.10910212 0.36774983
H  7.09802264 -1.88920558 1.57287604
H  4.68482496 -2.37314474 1.52150397
H  4.03319964 1.13622888 -0.88518705
H  6.46568525 1.60779271 -0.84883718
C  2.66646347 -0.88357945 0.26335409
C  8.4419985 0.18006989 0.38342718
H  8.97614493 -0.49882594 1.06249605
H  8.88006144 0.06356047 -0.6203318
H  8.64419111 1.21299831 0.70507585
C  1.90209406 0.18124294 1.05700392
C  0.48795989 0.26274425 0.95038295
C  2.54337914 1.08497924 1.90372686
C  -0.20760457 1.27057573 1.63764798
H  -0.32000077 -0.78390073 1.1026625
C  1.82236846 2.0690092 2.59364824
H  3.62656339 1.03776637 2.03121764
C  0.43709477 2.19884588 2.46501531
H  -1.29894433 1.29668356 1.54049137
H  2.36255906 2.75703479 3.25112294
C  2.26632338 -2.27851772 0.76343157
H  2.5007494 -2.39095943 1.83168684
H  1.18222519 -2.42747688 0.63918575
H  2.79401943 -3.04769929 0.18282903
C  2.30448319 -0.80920791 -1.23458566
O  1.61424166 0.21913511 -1.64336193
O  2.68054024 -1.69196712 -2.0126796
C  -0.33547357 3.27766357 3.17426994
H  -1.23941468 2.86914408 3.65121641
H  0.2730102 3.76214681 3.95103672
H  -0.66619907 4.05374506 2.46582867
Pd -0.24353211 -0.26906055 -0.92589296
O  -0.91534906 -0.66311257 -2.8047231
C  -2.2247347 -0.7490091 -2.89851052
O  -2.83102184 -0.69602318 -3.94711258
N  -2.0265602 -0.92918077 -0.47256231
C  -2.23560234 -1.50369445 0.6965501
O  -1.33226839 -1.56878607 1.57872544
O  -3.45060656 -2.0128953 0.88613733
Na 1.13202686 -0.95481561 -3.60165814
C  -3.90644623 -2.51968486 2.16911302
C  -5.35917877 -2.88299037 1.89440037
H  -5.92035239 -1.99307144 1.57298266
H  -5.41933436 -3.63979764 1.09915287
H  -5.82667683 -3.28696779 2.80366429
C  -3.82036822 -1.41557597 3.21719065
H  -4.34792988 -0.51755769 2.85895562
H  -4.30437472 -1.75165486 4.14598324
H  -2.77658845 -1.1559022 3.43325122
C  -3.10803961 -3.75618388 2.56369476
H  -2.06059327 -3.50037452 2.76368185
H  -3.54760465 -4.20019663 3.46923979
H  -3.14926788 -4.50436668 1.75806263
C  -2.97902403 -0.91505749 -1.56451644
H  -3.49636648 -1.88763202 -1.63200025
C  -4.05301076 0.1803525 -1.41656706
H  -4.56210105 0.25942015 -2.39038653
H  -4.79104859 -0.15454588 -0.67218256
C  -3.46616311 1.49780537 -0.97932156
C  -2.57501181 2.20786709 -1.79703652
C  -3.73659842 2.01664848 0.29346775
C  -1.96027434 3.37605586 -1.34892089
H  -2.35871644 1.84491324 -2.80594411
C  -3.14774489 3.19737237 0.74623783
H  -4.43043107 1.47880126 0.94769713
C  -2.24187227 3.87721167 -0.07277906
H  -1.25946412 3.91159428 -1.99695702
H  -3.36616801 3.600545 1.73739334
O  -1.6661674 5.01021894 0.40526524
H  -1.02888251 5.35245948 -0.23651039
