program: Gaussian 16
title: MN15/BS1
version: ES64L-G16RevC.01
method: RMN15
basis: GenECP
operation: Freq
keyword: #N
keyword: Geom=AllCheck
keyword: Guess=TCheck
keyword: SCRF=Check
keyword: GenChk
keyword: RMN15/GenECP
keyword: Freq
converged: YES YES YES YES
title: Mulliken charges:
elementType: C C C C C C H H H H C C H H H C C C C H C H C H H C H H H C O O C H H H Pd O C O N C H C O O C H H C C H C C C C C C H C C H C C H H C H H H H C H C H H H O H Na
charge: -0.007061 0.130168 -0.002721 0.014205 0.009717 -0.058263 -0.031973 -0.033167 -0.030463 -0.042058 -0.228766 0.089716 0.034829 0.003861 0.019700 0.085083 -0.025920 -0.031465 0.010894 0.278222 -0.007870 -0.041736 -0.022072 -0.022890 -0.034404 0.171993 0.034290 0.014436 0.006301 0.196632 -0.348954 -0.273665 0.093656 0.022899 0.024459 0.012685 -0.072441 -0.415719 0.233390 -0.261597 -0.298924 0.006915 0.046267 0.330666 -0.285618 -0.277574 0.252568 0.022638 0.026353 0.053420 -0.038106 0.030380 -0.052879 -0.013492 0.067192 0.020383 0.077729 0.038618 -0.043580 -0.021734 0.011688 -0.039188 -0.029901 0.030688 -0.012573 -0.039411 0.029668 -0.020795 -0.040532 -0.013460 -0.026388 0.133110 -0.023534 0.071212 0.000063 0.026867 0.014827 -0.299566 0.166529 0.625542
chargesum: -0.00000
title: Mulliken charges with hydrogens summed into heavy atoms:
elementType: C C C C C C C C C C C C C C C C O O C Pd O C O N C C O O C C C C C C C C C C C C C C C C O Na
charge: -0.039034 0.097000 -0.002721 -0.016257 -0.032341 -0.058263 -0.228766 0.148105 0.085083 0.252301 -0.073201 -0.011996 -0.042274 -0.022072 0.227020 0.196632 -0.348954 -0.273665 0.153699 -0.072441 -0.415719 0.233390 -0.261597 -0.298924 0.053182 0.330666 -0.285618 -0.277574 0.301559 0.083800 -0.038106 -0.052879 -0.057072 0.067192 -0.018805 0.077729 0.026045 -0.061145 -0.009106 -0.070433 0.017228 0.003280 0.109576 0.112969 -0.133037 0.625542
1716.lowfreq: -1182.5002 -6.8967 -3.2321 -1.2288 -0.0008 -0.0006 -0.0001 14.3000 24.2686
frequency: -1182.5002 14.1519 24.2608 27.4627 36.2093 45.0198 52.9807 61.6175 65.7465 67.0475 70.7103 78.0498 84.9439 88.6293 99.1295 101.9028 109.7260 113.7515 124.3808 127.3173 133.0645 140.8686 153.6612 155.7022 164.4286 179.2166 185.8390 193.4160 200.4097 206.1021 211.9514 225.5810 235.9737 241.7469 248.4886 255.3531 267.7711 277.1821 277.3559 296.2697 299.3407 305.7588 310.1918 328.5967 335.5571 343.9589 361.2027 367.0412 384.0647 393.6487 397.2909 408.5281 415.5785 416.6050 417.6390 428.0196 441.4401 451.8135 457.6952 467.2238 482.8557 501.4283 510.4752 512.5530 530.4237 542.3131 560.4545 562.0413 570.3082 575.0779 578.6219 593.1677 613.9690 614.9325 635.0045 658.6435 673.5554 685.9513 727.2012 735.0663 738.2891 751.6870 756.4401 760.5195 762.2386 764.1774 774.3865 779.0792 794.9848 805.8860 815.9408 819.9185 828.1219 835.5618 848.4412 851.9002 854.8328 859.6902 861.3120 892.8477 902.7496 909.2594 918.5246 932.8236 941.1368 948.1255 975.1231 975.6593 982.6191 984.3560 986.2948 989.2242 1002.7921 1003.1425 1008.5750 1015.0807 1019.7194 1028.4590 1030.9859 1031.8860 1039.6887 1043.6447 1045.8893 1050.8550 1052.6729 1056.3658 1079.5606 1098.7294 1107.9079 1120.3287 1123.7316 1135.3503 1143.8115 1149.0028 1151.5565 1156.8944 1159.6981 1166.2424 1174.8506 1182.6641 1191.0139 1198.2629 1216.1380 1224.4199 1234.3820 1236.5863 1243.8047 1249.5892 1254.1063 1257.8343 1265.2551 1282.9506 1285.7411 1292.8534 1298.3298 1303.9357 1322.7659 1325.7112 1331.6423 1338.6026 1355.8047 1360.6783 1364.3826 1373.2319 1375.7806 1376.8865 1376.9070 1378.6789 1401.1496 1404.4602 1411.2678 1416.7530 1417.8328 1426.2527 1429.5011 1431.0966 1434.3479 1436.1884 1440.5966 1445.1465 1450.3946 1454.0840 1457.3036 1482.2306 1488.0042 1514.3737 1520.3441 1538.2576 1551.9009 1560.5552 1639.5916 1651.9473 1662.9392 1672.0807 1677.8545 1694.3580 1698.4307 1699.4521 1741.0493 1758.4122 1815.6782 3053.1992 3068.4817 3068.8218 3071.5777 3080.5483 3084.1547 3106.2145 3135.4789 3151.3135 3151.7339 3153.0230 3172.6375 3173.0710 3174.4864 3175.4410 3181.4115 3186.9756 3202.2888 3205.7794 3206.8542 3210.2640 3216.1928 3216.7381 3221.3952 3222.2647 3223.4037 3232.1063 3233.1021 3239.0486 3240.9764 3241.9508 3252.5339 3709.8729
redmass: 1.1522 5.4678 5.8362 4.8019 5.1671 4.8564 6.9202 4.3519 5.5597 5.9529 6.2003 4.3575 1.2326 4.0478 4.2277 6.4080 6.3544 3.9900 3.4890 6.4728 1.1681 6.2160 3.7394 5.2437 6.6251 9.0617 8.7616 7.6282 6.8157 7.9795 4.4128 4.7565 3.3007 4.4195 4.4329 2.8969 1.5859 4.9928 4.6357 4.7107 5.0135 1.8078 3.6121 1.9210 3.9952 4.2406 3.2271 4.3233 3.3853 5.8044 5.5193 4.0442 3.5060 6.3509 4.3978 3.1249 7.2779 5.1674 3.0166 4.6678 4.5194 4.6002 4.6039 4.2583 3.4469 4.3236 2.8622 3.8331 5.2195 4.0558 3.3069 1.1335 4.5551 6.8441 6.7389 5.7924 6.3150 4.1514 4.7505 3.0720 4.6623 4.8803 3.1810 1.8619 1.6180 3.0190 4.3442 7.0512 3.2519 2.9375 2.3596 5.0625 4.5886 1.5206 2.1921 2.8439 1.4345 2.2241 2.6715 2.9885 1.5460 1.5942 2.4645 1.3751 2.4458 2.7828 1.3572 1.8669 1.3778 1.4117 1.4659 1.4530 1.3951 1.3905 4.4248 2.8505 2.7896 1.3703 3.1394 1.3633 1.6176 2.4355 1.6580 1.8759 1.6664 1.7953 2.0134 2.3094 1.6745 1.3811 1.3472 1.4862 1.2142 1.1415 2.0248 1.9890 1.2214 2.1169 1.9153 1.0929 1.7103 2.1936 1.3813 2.2196 1.9313 2.0940 1.7774 1.4803 3.7134 1.9774 3.6980 1.3293 1.3934 1.8076 2.2257 1.2919 2.1740 1.9836 1.5910 1.7079 5.8658 2.5516 1.8112 1.6087 1.5280 3.5022 1.5437 1.4183 3.5568 4.9339 2.5011 1.3960 1.6411 1.4007 1.1085 1.0815 1.0624 1.1059 1.0757 1.2406 1.3109 1.5060 1.8068 2.6806 3.0630 3.7557 3.3421 4.5332 3.2217 6.1052 6.6243 7.2738 7.1860 7.7525 7.1532 7.9112 7.6901 7.2322 10.9817 7.8795 11.9590 1.0378 1.0382 1.0396 1.0837 1.0368 1.0838 1.0605 1.0913 1.0988 1.1025 1.1001 1.1027 1.1090 1.1043 1.1045 1.1048 1.0921 1.1033 1.0891 1.0889 1.0903 1.0863 1.0896 1.0904 1.0965 1.0904 1.0957 1.0935 1.0931 1.0998 1.0933 1.0990 1.0659
irintensity: 2010.9973 0.2858 0.5199 0.4444 0.6682 0.2352 1.4777 0.8089 0.7921 0.4473 5.3127 0.6249 0.6447 0.8119 3.1262 4.2710 1.7220 1.3271 1.7098 1.2090 0.3959 6.9387 0.4464 0.1613 3.4974 9.1361 2.2893 11.4183 8.6800 6.1186 0.2012 9.0517 9.3518 2.6406 6.4832 3.7709 6.8539 15.7839 1.3197 5.9257 4.8388 1.4846 1.2563 4.4149 10.3702 16.8884 0.7657 15.0446 2.2417 34.3485 12.3857 3.7566 9.9625 0.1561 20.3152 7.5751 20.5854 4.6076 1.0214 2.5300 4.4331 19.4388 2.6773 4.3677 9.7807 2.6968 18.4592 1.2593 7.7230 14.1942 0.0158 109.4692 5.2949 5.0967 0.2506 16.0266 6.6101 14.8335 19.5989 5.3440 0.3535 2.5241 29.6865 5.1728 88.3751 11.2150 9.1231 17.3531 11.6118 6.5200 1.1494 7.1557 25.0984 20.3920 2.1369 2.7589 3.6538 1.1265 1.0330 17.1474 3.8888 0.4549 18.8287 4.0936 8.9250 5.0242 0.8686 8.9947 1.7626 1.1858 0.4756 0.7270 2.0457 2.3764 0.3769 4.9423 4.6576 0.0883 25.3801 0.1718 8.7305 1.5002 9.2276 0.4702 8.5898 15.5418 0.8086 18.3441 7.2709 10.8631 0.2011 13.3071 1.3164 1.8204 26.7333 0.7709 2.1990 63.9337 33.2494 3.9022 283.5535 148.8206 142.2274 35.2641 46.7043 7.5734 3.1560 95.3457 1.9947 55.6622 16.3979 39.8640 2.5640 29.0140 5.8602 0.7905 9.0311 41.9157 56.1943 11.1789 10.7254 5.3061 5.4839 152.7095 10.4015 56.6794 11.8967 18.7936 378.0033 3.3172 159.9925 13.7274 11.8551 4.9757 16.2416 5.3971 8.8387 2.8432 13.0716 14.1809 6.1329 55.5511 5.3496 25.2647 12.6093 42.8766 3.3386 2.0876 16.9796 283.9153 7.0011 0.0615 0.7930 0.5028 1.2928 2.7930 0.6410 1.2987 612.1213 204.3816 611.8312 7.8866 26.3450 24.7896 5.7470 15.2837 7.8687 32.5968 0.9094 24.2453 14.2562 12.4085 17.5060 8.4864 10.7555 16.6227 16.3284 3.4300 4.0665 13.9551 2.2451 14.3091 1.2987 9.0762 1.8835 12.4064 1.8866 14.0360 6.3685 8.4737 16.3305 11.4398 13.1404 153.6299
temp: 333.150 k
press: 1.00000 atm
elementType: 6 6 6 6 6 6 1 1 1 1 6 6 1 1 1 6 6 6 6 1 6 1 6 1 1 6 1 1 1 6 8 8 6 1 1 1 46 8 6 8 7 6 1 6 8 8 6 1 1 6 6 1 6 6 6 6 6 6 1 6 6 1 6 6 1 1 6 1 1 1 1 6 1 6 1 1 1 8 1 11
symmnumber: 1
zpe: 1648599.7 jmol-1
zpe.correction: 0.627918 hartree
zpe.thermalcorrener: 0.679430 hartree
zpe.thermalcorrenthalpy: 0.680485 hartree
zpe.thermalcorrgfe: 0.539317 hartree
zpe.sumelectzpe: -2259.085667 hartree
zpe.sumelectthermal: -2259.034156 hartree
zpe.sumelectthermalent: -2259.033101 hartree
zpe.sumelectthermalfe: -2259.174269 hartree
dipole: 2.4230 1.9524 0.8213
dipole: 3.2183
quadrupole: -278.4656 -271.1183 -262.4306
quadrupole: -11.1623 -14.3745 -0.5489
quadrupole: -7.7941 -0.4467 8.2409 -11.1623 -14.3745 -0.5489
hfenergy: -2259.7135857 hartree
pointgroup: C01 [X(C36H34N1Na1O7Pd1)]
dipole: 0.9530527 0.7713929 0.3159621 debye
polarizability: 444.4806521|77.1733248|459.0944038|-3.1337298|-26.0317044|387.4145094 unknown
InChI: InChI=1/C19H17NO5.C17H17O2.Na.Pd/c1-11(21)17(18(22)23)20-19(24)25-10-16-14-8-4-2-6-12(14)13-7-3-5-9-15(13)16;1-12-4-8-14(9-5-12)17(3,16(18)19)15-10-6-13(2)7-11-15;;/h2-9,11,16-17,21H,10H2,1H3;4-11H,1-3H3;;/q2*-1;2*+1/rC36H34NNaO7Pd/c1-21-13-16-24(17-14-21)35(4)30-18-15-22(2)19-31(30)46-37(32(23(3)39)33(40)44(46)38-36(35,43-38)45(38)46)34(41)42-20-29-27-11-7-5-9-25(27)26-10-6-8-12-28(26)29/h5-19,23,29,31-32,39H,20H2,1-4H3
charge 0 multiplicity 1
80 atoms
C  1.63491402 -1.68244593 2.84684337
C  2.49639274 -1.38268584 1.79085399
C  3.01582688 -0.09203569 1.62933054
C  2.6924389 0.86608828 2.59819771
C  1.84729064 0.56019065 3.66340491
C  1.27957542 -0.71297047 3.79284072
H  1.21827642 -2.69123289 2.92641528
H  2.74909458 -2.16856861 1.07593588
H  3.07279054 1.88623505 2.48779743
H  1.59320494 1.33750591 4.3896361
C  3.85014971 0.3540992 0.41651207
C  0.31432069 -1.03969314 4.90073842
H  0.7621472 -1.7240537 5.63853255
H  -0.00406966 -0.13376094 5.43602847
H  -0.58338683 -1.53781199 4.50212676
C  3.11506297 1.51548347 -0.26077776
C  1.74108497 1.36395139 -0.58782271
C  3.75606987 2.69477771 -0.63193179
C  1.07614852 2.37336762 -1.29855039
H  0.87163665 0.94526371 0.30147815
C  3.06801284 3.69287737 -1.33543395
H  4.80997021 2.8516474 -0.39456731
C  1.72355383 3.55375872 -1.6909164
H  0.00950856 2.24101676 -1.51597393
H  3.60180802 4.60482357 -1.61980479
C  5.27140674 0.69554011 0.87903845
H  5.70818439 -0.19123099 1.35532346
H  5.91475849 0.97636302 0.03206345
H  5.25676489 1.52364844 1.60261633
C  3.96715556 -0.79932041 -0.60385201
O  3.22263127 -0.7410289 -1.66794352
O  4.71800622 -1.75789534 -0.39828358
C  0.99126339 4.63813165 -2.43458781
H  0.25350137 4.21459472 -3.13131156
H  0.44251277 5.29527744 -1.73993726
H  1.68457775 5.27027428 -3.00742134
Pd 1.30984603 -0.65780797 -0.96814529
O  1.10369166 -2.6243299 -1.41867545
C  -0.07644428 -3.13478069 -1.16508555
O  -0.40845859 -4.25132036 -1.53204655
N  -0.44930293 -0.94704837 -0.14556841
C  -1.04891084 -2.24645131 -0.38724938
H  -1.26573654 -2.76372743 0.56444781
C  -0.78047595 -0.18733462 0.88291639
O  -0.161567 0.86272979 1.1885982
O  -1.81182517 -0.60882831 1.6226517
C  -2.4025281 0.28737098 2.55072464
H  -2.84060633 -0.34725232 3.33447474
H  -1.62569925 0.92747011 2.99840619
C  -3.49928779 1.12022311 1.88026267
C  -4.40908913 0.27502239 1.01093485
H  -4.07362364 1.60522221 2.69080557
C  -3.00965387 2.17505177 0.90719949
C  -5.09296672 -0.89382679 1.33182221
C  -4.43411213 0.77682765 -0.30268721
C  -2.1488666 3.24579417 1.1308123
C  -3.56888509 1.96283386 -0.36504341
C  -5.80969257 -1.55478338 0.32890609
H  -5.05674569 -1.30536431 2.34421263
C  -5.16906607 0.13051939 -1.29907296
C  -1.85867868 4.11174555 0.07318506
H  -1.69368771 3.40079386 2.11231097
C  -3.27221634 2.8225378 -1.42690619
C  -5.85188278 -1.04300361 -0.9736057
H  -6.33254345 -2.48489325 0.55940279
H  -5.18781591 0.52037495 -2.32011287
C  -2.41907534 3.90295011 -1.19446946
H  -1.18536002 4.95703479 0.23552269
H  -3.70871006 2.65906245 -2.41540301
H  -6.41132199 -1.57768587 -1.74388191
H  -2.18283916 4.59216507 -2.00888807
C  -2.39688467 -2.15893026 -1.13925716
H  -3.03582241 -1.50441628 -0.52666017
C  -2.23166817 -1.54370088 -2.52191201
H  -3.21312756 -1.47649188 -3.01240516
H  -1.79722081 -0.53252912 -2.45437337
H  -1.57786819 -2.17166381 -3.15099582
O  -3.0086817 -3.41605487 -1.17626422
H  -2.32094317 -4.05242953 -1.45277498
Na 3.26613824 -3.03058753 -1.83155262
