program: Gaussian 16
title: MN15/BS1
version: ES64L-G16RevC.01
method: RMN15
basis: GenECP
operation: Freq
keyword: #N
keyword: Geom=AllCheck
keyword: Guess=TCheck
keyword: SCRF=Check
keyword: GenChk
keyword: RMN15/GenECP
keyword: Freq
converged: YES YES YES YES
title: Mulliken charges:
elementType: C C C C C C H H H H C C H H H C C C C H C H C H H C H H H C O O C H H H Pd Na O C O C H N C H C H O C O O H H H H C H H C C H C C C C C C H C C H C C H H C H H H H O C O C H C N H H C H C C C O O C H C H C C H H C C C O H H H H H H H H H H
charge: -0.004728 -0.000529 0.039790 0.003005 -0.013470 -0.045402 -0.037010 0.003740 -0.040074 -0.041572 -0.184654 0.083738 0.025239 0.006457 0.032312 0.031529 -0.094398 0.034688 0.036108 0.279987 -0.012409 -0.022895 -0.024845 -0.042985 -0.034999 0.158398 0.030498 0.006773 0.027697 0.240304 -0.335905 -0.252691 0.090328 0.022657 0.012337 0.014180 -0.042924 0.359231 -0.249185 0.255541 -0.365880 0.025855 0.034205 -0.105959 0.068616 0.154205 0.244826 0.026054 -0.301845 0.039023 -0.291126 -0.291899 0.171007 0.026391 0.057921 -0.008532 0.249909 0.025173 0.048328 0.093501 -0.143710 0.026518 -0.065172 0.050181 0.066161 -0.021282 0.076697 0.081421 -0.029748 0.009931 0.025313 -0.037499 -0.019650 0.013599 0.005654 -0.027797 0.024609 -0.013812 -0.030720 -0.013758 -0.013189 -0.251804 0.186392 -0.261993 0.054497 0.038814 0.212352 -0.151936 0.029569 -0.014816 -0.063276 0.145675 0.201404 -0.015917 0.013369 -0.251067 -0.290060 -0.020621 -0.025211 0.002788 -0.014295 -0.182309 0.118253 -0.046668 -0.013285 0.093039 0.107050 0.085065 -0.185266 0.013513 0.009653 0.015104 0.005391 0.002322 0.035283 0.010084 0.042464 0.007287 0.181773
chargesum: -0.00000
title: Mulliken charges with hydrogens summed into heavy atoms:
elementType: C C C C C C C C C C C C C C C C O O C Pd Na O C O C N C C O C O O C C C C C C C C C C C C C C O C O C C N C C C C O O C C C C C C C O
charge: -0.041738 0.003211 0.039790 -0.037069 -0.055042 -0.045402 -0.184654 0.147746 0.031529 -0.094398 0.011793 -0.006877 -0.047407 -0.024845 0.223366 0.240304 -0.335905 -0.252691 0.139503 -0.042924 0.359231 -0.249185 0.255541 -0.365880 0.060060 0.048246 0.094669 0.244826 -0.130838 0.114803 -0.291126 -0.291899 0.323411 0.120019 -0.143710 -0.065172 0.020433 0.066161 -0.058781 0.076697 0.087075 -0.017866 0.011501 -0.050370 -0.000159 0.011420 -0.251804 0.186392 0.017994 0.093311 0.227106 -0.006260 -0.063276 0.201404 -0.041128 -0.000926 -0.251067 -0.290060 -0.067288 -0.010497 -0.182309 0.118253 0.131309 0.150046 0.144900 -0.003493
chargesum: -0.00001
1716.lowfreq: -1244.7144 -1.0583 -0.0020 -0.0012 0.0006 1.5862 3.4396 13.1880 14.7508
redmass: 1.1289 5.4149 5.6249 4.4040 5.6396 5.7605 5.2875 4.7761 5.4660 4.4178 1.5530 2.9166 5.7730 4.2916 3.3153 3.9622 6.1695 5.2471 6.9257 3.9575 4.8716 4.8875 5.4206 5.6508 4.4794 5.7483 4.8155 4.8879 4.9960 5.0149 4.0415 4.7861 6.3824 7.0955 3.6974 3.5988 2.3937 5.1137 5.0483 6.2939 5.7152 9.6934 4.9161 5.6940 8.2117 5.6166 4.7220 4.7242 1.1858 6.6068 5.2668 3.8943 4.3653 3.2522 1.2577 2.8245 2.3568 1.7916 4.4127 2.9685 1.2915 3.3968 4.8717 3.9044 3.6737 3.2113 3.5896 2.7153 2.9040 1.3138 3.6762 2.3796 1.8076 3.2552 3.3552 3.4786 4.2662 4.1344 1.9233 1.8900 3.9812 2.9406 4.1135 5.0051 3.0308 2.9200 2.7750 3.9270 3.7251 4.4780 4.4326 5.8805 2.8898 3.3842 4.1631 5.3372 3.9147 4.9560 5.1463 3.3091 3.2378 3.4163 2.0502 2.3372 3.0075 2.8854 3.2066 3.6818 2.2572 2.5464 2.3887 5.3544 4.3618 4.2813 6.5996 6.7307 4.9804 6.4283 4.6633 4.3177 4.5393 4.2297 3.1759 4.7286 2.5066 3.4105 4.2341 1.9114 3.2188 1.8786 4.2072 3.9659 4.7617 4.3258 5.5459 3.4450 4.6199 4.3064 7.2293 2.3186 1.3523 2.4417 1.8109 2.2850 1.4676 2.9218 1.3193 4.5747 1.8313 2.9392 2.8516 1.3469 2.5593 2.4070 1.7343 1.5272 1.5444 1.3349 1.2072 1.9840 3.1428 1.4910 1.3969 1.6634 1.3862 1.4290 1.5779 1.7356 1.4594 2.1487 1.7019 1.7653 5.2321 2.5834 1.4351 2.0593 1.6506 1.4773 1.5376 2.3852 1.3653 1.6278 1.7553 1.6129 1.8636 2.0915 3.6281 1.9090 1.9804 4.4136 2.4174 2.1494 1.3564 1.8457 1.2917 1.2527 1.3618 2.3378 1.2074 2.0486 1.4597 1.3564 1.2401 1.1209 1.2271 1.4002 1.7116 1.0915 1.8595 1.9026 1.6236 1.7933 1.6854 2.3481 2.3453 2.0307 1.9450 1.7988 2.5096 1.9397 2.0797 1.6619 2.3332 1.6843 2.1075 3.0098 1.8551 1.5618 1.5090 1.3240 1.4822 2.1809 1.7510 1.6252 2.0191 1.3476 3.9025 1.6587 1.7026 4.6030 1.5552 1.7190 1.8359 2.9147 2.2066 1.4406 1.4533 1.3899 1.3206 4.7524 4.5702 1.5656 1.5653 4.9459 1.0439 1.1480 1.4327 1.4982 1.2117 2.7678 1.0488 1.0541 1.2018 1.1069 1.0559 1.1372 1.1008 1.1837 1.0878 1.4892 1.0507 1.8567 1.0736 3.3771 2.6401 2.9382 3.2962 4.3114 3.8860 4.4550 3.9067 3.2516 3.9566 3.8849 6.9035 7.0133 7.2559 7.4323 7.0943 6.9682 7.9328 7.7739 7.1857 7.3679 7.4546 11.9555 12.6576 11.4598 11.6410 1.0833 1.0458 1.0421 1.0383 1.0354 1.0369 1.0367 1.0382 1.0616 1.0858 1.0596 1.0867 1.1048 1.0989 1.1026 1.0969 1.1039 1.0883 1.1041 1.1038 1.0920 1.1041 1.1051 1.1047 1.1095 1.1052 1.1028 1.0896 1.1035 1.0884 1.0903 1.1036 1.0907 1.0894 1.0893 1.1033 1.0971 1.0907 1.0894 1.0956 1.0946 1.0941 1.0957 1.0933 1.0994 1.0921 1.0954 1.0950 1.0776 1.0776 1.0660 1.0660
temp: 333.150 k
press: 1.00000 atm
elementType: 6 6 6 6 6 6 1 1 1 1 6 6 1 1 1 6 6 6 6 1 6 1 6 1 1 6 1 1 1 6 8 8 6 1 1 1 46 11 8 6 8 6 1 7 6 1 6 1 8 6 8 8 1 1 1 1 6 1 1 6 6 1 6 6 6 6 6 6 1 6 6 1 6 6 1 1 6 1 1 1 1 8 6 8 6 1 6 7 1 1 6 1 6 6 6 8 8 6 1 6 1 6 6 1 1 6 6 6 8 1 1 1 1 1 1 1 1 1 1
symmnumber: 1
zpe: 2499824.1 jmol-1
zpe.correction: 0.952133 hartree
zpe.thermalcorrener: 1.030684 hartree
zpe.thermalcorrenthalpy: 1.031739 hartree
zpe.thermalcorrgfe: 0.828380 hartree
zpe.sumelectzpe: -3232.744868 hartree
zpe.sumelectthermal: -3232.666317 hartree
zpe.sumelectthermalent: -3232.665262 hartree
zpe.sumelectthermalfe: -3232.868621 hartree
dipole: -2.0604 0.8616 -1.9934
dipole: 2.9936
quadrupole: -341.8201 -398.2863 -374.5330
quadrupole: -1.1187 -16.7827 4.3446
quadrupole: 29.7264 -26.7399 -2.9865 -1.1187 -16.7827 4.3446
hfenergy: -3233.6970006 hartree
pointgroup: C01 [X(C50H53N2Na1O12Pd1)]
dipole: -0.8081655 0.3401438 -0.7863121 debye
polarizability: 723.6036483|-18.8001689|615.2797437|12.8392198|-56.2395891|543.3918815 unknown
InChI: InChI=1/C31H35NO7.C19H18NO5.Na.Pd/c1-19-7-12-22(13-8-19)31(6,28(35)36)24-16-9-20(2)17-26(24)40-39-27(34)25(32-29(37)38-30(3,4)5)18-21-10-14-23(33)15-11-21;1-11(21)17(18(22)23)20-19(24)25-10-16-14-8-4-2-6-12(14)13-7-3-5-9-15(13)16;;/h7-17,25,32-33H,18H2,1-6H3;2-9,11,16-17,20-21H,10H2,1H3;;/q-2;-1;+2;+1/rC50H53N2NaO12Pd/c1-29-16-21-33(22-17-29)49(7)41-25-18-30(2)27-50(41)66(62-44(63-67-50)40(51-46(57)59-48(4,5)6)26-32-19-23-34(55)24-20-32)53(60-45(49)65(53)66)61-47(52-42(31(3)54)43(56)64(53)66)58-28-39-37-14-10-8-12-35(37)36-13-9-11-15-38(36)39/h8-25,27,31,39-40,42,51-52,54-55H,26,28H2,1-7H3
charge 0 multiplicity 1
119 atoms
C  2.45980861 6.29870314 -0.18384337
C  2.23942614 4.92667831 -0.20879087
C  1.96585762 4.25980226 -1.41563322
C  1.91869166 5.01380649 -2.58791093
C  2.14514628 6.39468544 -2.55837817
C  2.41760411 7.06205456 -1.36247569
H  2.67061957 6.79343981 0.76876574
H  2.28406792 4.34505997 0.71736646
H  1.70478651 4.53535332 -3.54496329
H  2.10570371 6.9642643 -3.49139645
C  1.74463171 2.74560599 -1.3799366
C  2.64815828 8.54888275 -1.32400892
H  3.59718453 8.79371039 -0.82314635
H  2.67699418 8.97659593 -2.3357975
H  1.84833899 9.06007262 -0.7656097
C  3.00400079 2.00888342 -0.92731941
C  2.92526595 0.68122293 -0.44633951
C  4.26850091 2.59626611 -1.02836724
C  4.092614 0.00455856 -0.03974362
H  2.1484327 -0.18604197 -1.13283406
C  5.4132132 1.90984344 -0.62086357
H  4.36374147 3.61454498 -1.4111951
C  5.3518569 0.60907965 -0.10475443
H  4.00323464 -1.02303801 0.33624792
H  6.38485563 2.40801052 -0.69412634
C  1.29350895 2.18031144 -2.73227097
H  1.0923387 1.10223286 -2.6381795
H  2.07746156 2.31285963 -3.49208562
H  0.37093405 2.68183443 -3.0561234
C  0.58070387 2.56526206 -0.38719245
O  0.85161591 2.12855607 0.81319377
O  -0.55970009 2.88581131 -0.72393128
C  6.60285029 -0.0904108 0.35484214
H  7.23836931 0.58888612 0.94227114
H  6.371213 -0.96530872 0.97653134
H  7.20308811 -0.43250667 -0.50515867
Pd 1.25935864 0.17068455 0.66873983
Na -1.51328419 1.59190689 0.99276862
O  1.31703099 -0.23755196 3.52122416
C  0.13512118 -0.21500301 3.20461122
O  -0.30731474 -0.12181082 1.9948612
C  -0.9311082 -0.26977427 4.31701081
H  -0.94650965 0.74683739 4.75494222
N  -2.26640928 -0.60277513 3.86799667
C  -0.50048944 -1.29076928 5.40689647
H  -2.68555807 -1.43363662 4.28529609
C  -3.07294642 0.27568341 3.25242624
H  -0.02914223 -2.14434161 4.8945172
O  -1.6269661 -1.82322106 6.07431202
C  0.4805165 -0.68227221 6.38905793
O  -2.74084465 1.39321922 2.86990265
O  -4.32257662 -0.20967306 3.10465904
H  -1.9092567 -1.1906257 6.75142538
H  0.8057196 -1.43648922 7.11922272
H  1.35029125 -0.28624725 5.85191981
H  -0.00484873 0.14850958 6.93152363
C  -5.22584849 0.55848011 2.3254109
H  -6.19783402 0.52836027 2.83788139
H  -4.87679382 1.59996045 2.28705271
C  -5.36267247 0.00715771 0.89700806
C  -4.03386663 -0.22710535 0.21418367
H  -5.94690781 -0.92814189 0.92508971
C  -6.00398806 1.05297209 0.01061083
C  -3.04104839 -1.15360438 0.51966463
C  -3.88509514 0.6453932 -0.88636482
C  -7.2554543 1.65183678 0.12250787
C  -5.11017624 1.45096746 -1.00257817
C  -1.88798411 -1.19627373 -0.27351176
H  -3.14842282 -1.840677 1.36074642
C  -2.72826899 0.61020489 -1.67037992
C  -7.61134475 2.64997345 -0.79200071
H  -7.95491141 1.34776547 0.90607678
C  -5.46431391 2.44841825 -1.91233026
C  -1.72813944 -0.32007023 -1.35364561
H  -1.10394707 -1.90986163 -0.01918696
H  -2.59519973 1.2998816 -2.50696828
C  -6.72265997 3.0442538 -1.79839691
H  -8.591905 3.12544935 -0.7199712
H  -4.77035736 2.75849124 -2.69729401
H  -0.81187651 -0.36288771 -1.94972625
H  -7.01674098 3.82623219 -2.50182218
O  1.37502265 -1.82258806 0.30124087
C  1.42595946 -2.08441484 -0.93236466
O  1.72631821 -1.24149314 -1.82565837
C  1.06879415 -3.48305315 -1.41529514
H  0.65718919 -4.05024577 -0.56915604
C  2.32028969 -4.15400051 -1.99905135
N  0.02281892 -3.36624453 -2.4038007
H  2.08152068 -5.21389155 -2.18398376
H  2.5207502 -3.68949176 -2.97756762
C  3.5395688 -3.99433045 -1.12476339
H  0.20089168 -2.78473998 -3.21935578
C  -1.26257373 -3.78238092 -2.18507984
C  4.72604901 -3.47021687 -1.64704437
C  3.5100052 -4.32076158 0.24052782
O  -1.6278187 -4.39457407 -1.20185959
O  -2.03085239 -3.41484812 -3.21861921
C  5.85664986 -3.29939134 -0.84789756
H  4.7690075 -3.18829243 -2.70257861
C  4.62473732 -4.14138613 1.05312647
H  2.59127789 -4.71314095 0.68515788
C  -3.43260866 -3.77545328 -3.29920094
C  5.81001212 -3.63231602 0.50904274
H  6.77887442 -2.89378918 -1.27544874
H  4.59931057 -4.38513165 2.11638527
C  -3.86641223 -3.18034426 -4.63176769
C  -4.21263176 -3.13786909 -2.15535425
C  -3.57889251 -5.29324634 -3.31383718
O  6.87092935 -3.46287996 1.33529216
H  -3.27904961 -3.61349881 -5.45439093
H  -4.93167008 -3.38637527 -4.80960135
H  -3.71249132 -2.0913896 -4.62573967
H  -4.06201456 -2.04695628 -2.15387811
H  -5.28570103 -3.34110303 -2.29105038
H  -3.88948644 -3.54309988 -1.18807272
H  -2.96658459 -5.72441506 -4.12037673
H  -3.26661319 -5.72490555 -2.35481213
H  -4.63026972 -5.55833238 -3.4998759
H  7.61792329 -3.09491705 0.8429834
