program: Gaussian 16
title: MN15/BS1
version: ES64L-G16RevC.01
method: RMN15
basis: GenECP
operation: Freq
keyword: #N
keyword: Geom=AllCheck
keyword: Guess=TCheck
keyword: SCRF=Check
keyword: GenChk
keyword: RMN15/GenECP
keyword: Freq
converged: YES YES YES YES
title: Mulliken charges:
elementType: C C C C C C H H H H C C H H H C C C C H C H C H H C H H H C O O C H H H Pd Na O C O C H N C H C H O C O O H H H H C H H C C H C C C C C C H C C H C C H H C H H H H O C O C H C N H H C H C C C O O C H C H C C H H C C C O H H H H H H H H H H
charge: -0.003551 0.001341 0.039322 0.002592 -0.012152 -0.045817 -0.036628 0.002154 -0.039092 -0.040837 -0.189848 0.083609 0.026420 0.006829 0.032097 0.030722 -0.105442 0.030943 0.004260 0.293225 -0.009289 -0.022088 -0.025297 -0.036117 -0.032768 0.159501 0.032455 0.005621 0.029524 0.240494 -0.343430 -0.248476 0.093174 0.042499 0.015213 0.014532 -0.012497 0.367702 -0.249762 0.252280 -0.365932 0.026021 0.033244 -0.107287 0.068719 0.153562 0.247603 0.025780 -0.301762 0.039084 -0.292393 -0.292005 0.171337 0.056600 -0.007985 0.027160 0.250658 0.025692 0.046893 0.078470 -0.129141 0.028964 -0.064884 0.043096 0.062202 -0.018015 0.080516 0.070014 -0.031492 0.018740 0.024050 -0.037186 -0.019548 0.017767 0.003833 -0.026789 0.025789 -0.013628 -0.029641 -0.005943 -0.013001 -0.274842 0.193951 -0.259041 0.059355 0.041475 0.139927 -0.151460 -0.019268 0.031316 -0.017321 0.144213 0.216571 -0.006098 0.024464 -0.245938 -0.289616 -0.029372 -0.036336 -0.004686 -0.024917 -0.180266 0.129235 -0.046462 -0.021676 0.086262 0.101861 0.089808 -0.188497 0.004962 0.044755 0.010536 0.044789 0.003345 -0.009098 0.012515 0.008343 0.015405 0.179227
chargesum: -0.00000
title: Mulliken charges with hydrogens summed into heavy atoms:
elementType: C C C C C C C C C C C C C C C C O O C Pd Na O C O C N C C O C O O C C C C C C C C C C C C C C O C O C C N C C C C O O C C C C C C C O
charge: -0.040179 0.003495 0.039322 -0.036500 -0.052989 -0.045817 -0.189848 0.148955 0.030722 -0.105442 0.008856 -0.031857 -0.042058 -0.025297 0.227101 0.240494 -0.343430 -0.248476 0.165417 -0.012497 0.367702 -0.249762 0.252280 -0.365932 0.059266 0.046275 0.094500 0.247603 -0.130425 0.114859 -0.292393 -0.292005 0.323243 0.107433 -0.129141 -0.064884 0.011604 0.062202 -0.055201 0.080516 0.073847 -0.008049 0.010422 -0.049189 0.011824 0.012789 -0.274842 0.193951 0.034184 0.100830 0.151974 -0.007247 -0.017321 0.216571 -0.042434 -0.000453 -0.245938 -0.289616 -0.075834 -0.026362 -0.180266 0.129235 0.146515 0.140898 0.126072 -0.009270
1716.lowfreq: -1299.8494 -3.0155 -0.0024 -0.0019 -0.0011 2.8338 4.8850 7.2031 9.4879
redmass: 1.1175 5.3105 5.9278 5.5433 5.2759 4.4184 5.4163 5.9668 4.5297 5.5864 5.6755 1.6454 2.2312 3.8863 3.1854 1.3505 3.5601 5.4550 3.2840 5.5943 4.9719 4.7394 3.8215 5.4079 5.6777 5.0347 5.3756 5.1566 6.3553 5.3910 7.0012 5.3580 4.6956 5.5549 7.2227 6.7048 4.8338 5.3486 7.3219 6.2590 7.0295 4.6334 6.5143 7.0344 7.7856 4.8680 3.4814 1.5170 4.4388 5.8350 7.0858 3.7410 3.4033 1.4248 3.6132 1.1812 3.1031 6.1694 1.1103 4.5118 4.5889 4.6495 4.4168 3.3471 3.7544 4.1540 2.8733 1.8826 1.4125 2.9383 2.5330 2.3604 2.0249 3.4445 3.3961 1.4802 4.4798 2.6718 4.3277 3.9268 4.4272 4.3720 3.2582 4.4580 2.8666 2.7982 2.9498 4.8285 3.3394 4.2576 4.4388 3.9131 3.2590 3.4000 2.0064 2.8580 4.6344 2.4313 4.8852 4.0976 4.9567 3.4418 3.3786 4.1476 3.6060 2.7106 3.2512 3.8410 2.0319 1.6889 5.7899 5.7382 4.2490 4.3001 6.5833 6.5977 5.0200 6.4158 4.6450 4.4312 4.4860 4.2160 6.2581 4.7087 3.8069 2.4473 3.2416 1.7208 3.7182 1.6991 3.5001 6.0389 4.1181 5.4402 6.5565 3.4254 3.9355 4.9523 2.7612 3.2643 1.5297 2.7023 1.8402 1.7971 1.6508 2.9462 1.3385 4.0795 2.9298 1.8372 2.1440 1.3356 2.1720 2.0076 1.7697 1.5436 1.6939 1.5495 1.2148 1.9696 1.4222 2.9695 1.3983 1.7140 1.3921 1.3900 1.5630 1.8294 1.4723 2.0084 2.5000 1.6498 4.3794 2.9679 2.2407 1.4277 1.4183 2.5762 1.4701 1.3730 2.8770 1.3650 1.6292 1.6842 1.6960 1.8971 2.1024 3.5010 1.8657 1.6516 2.0568 1.6611 1.7297 2.0210 1.9456 1.3556 1.3479 1.8216 1.2214 1.1247 1.5901 3.1255 1.3851 1.0945 1.2693 1.2446 1.0940 1.7013 1.8619 1.7070 1.4445 2.3459 1.7225 1.7146 2.3412 2.3345 2.0377 1.6826 2.1129 2.9266 2.1379 1.6411 2.2672 1.9909 1.6818 1.8895 2.7266 1.8534 1.5170 1.3319 1.3109 2.1711 1.6017 1.8601 1.3454 2.3813 2.5943 1.6914 1.6445 1.8039 5.1565 1.5949 2.0365 2.6224 2.3912 1.4386 1.3872 1.3668 1.3210 5.5090 4.7029 1.4682 1.5755 5.1740 1.0445 1.3935 1.4541 1.0620 3.4529 1.1575 1.0450 1.0537 1.0780 1.0942 1.2462 1.1374 1.1026 1.1366 1.0846 1.6395 1.0512 1.8757 1.0891 3.3506 2.6831 3.0170 3.3593 4.4422 3.6968 4.4847 3.2480 4.3931 3.9611 4.0232 7.0000 7.2557 7.1514 7.5019 7.1350 7.0231 7.9430 7.7823 7.1875 7.4515 7.9084 12.2985 12.6740 11.4574 11.6262 1.0839 1.0452 1.0655 1.0354 1.0383 1.0387 1.0370 1.0365 1.0384 1.0859 1.0596 1.0867 1.0886 1.0986 1.1026 1.1019 1.0969 1.1036 1.1042 1.1040 1.1041 1.1049 1.1050 1.1047 1.1056 1.1094 1.0910 1.0893 1.1038 1.0883 1.0898 1.0907 1.1031 1.0894 1.0910 1.0955 1.1033 1.0971 1.0893 1.0880 1.0946 1.0946 1.0938 1.0933 1.0996 1.0933 1.0952 1.0969 1.0775 1.0783 1.0660 1.0660
temp: 333.150 k
press: 1.00000 atm
elementType: 6 6 6 6 6 6 1 1 1 1 6 6 1 1 1 6 6 6 6 1 6 1 6 1 1 6 1 1 1 6 8 8 6 1 1 1 46 11 8 6 8 6 1 7 6 1 6 1 8 6 8 8 1 1 1 1 6 1 1 6 6 1 6 6 6 6 6 6 1 6 6 1 6 6 1 1 6 1 1 1 1 8 6 8 6 1 6 7 1 1 6 1 6 6 6 8 8 6 1 6 1 6 6 1 1 6 6 6 8 1 1 1 1 1 1 1 1 1 1
symmnumber: 1
zpe: 2496369.4 jmol-1
zpe.correction: 0.950817 hartree
zpe.thermalcorrener: 1.030179 hartree
zpe.thermalcorrenthalpy: 1.031234 hartree
zpe.thermalcorrgfe: 0.820637 hartree
zpe.sumelectzpe: -3232.738823 hartree
zpe.sumelectthermal: -3232.659461 hartree
zpe.sumelectthermalent: -3232.658406 hartree
zpe.sumelectthermalfe: -3232.869003 hartree
dipole: -1.3779 -0.6624 -2.4326
dipole: 2.8731
quadrupole: -366.3416 -363.9329 -382.6736
quadrupole: 29.3173 -16.5441 -8.8942
quadrupole: 4.6411 7.0498 -11.6909 29.3173 -16.5441 -8.8942
hfenergy: -3233.6896398 hartree
pointgroup: C01 [X(C50H53N2Na1O12Pd1)]
dipole: -0.5428764 -0.2749589 -0.952583 debye
polarizability: 705.7325319|12.0917887|643.9788735|70.9764996|-20.0687416|563.6565561 unknown
InChI: InChI=1/C31H35NO7.C19H18NO5.Na.Pd/c1-19-7-12-22(13-8-19)31(6,28(35)36)24-16-9-20(2)17-26(24)40-39-27(34)25(32-29(37)38-30(3,4)5)18-21-10-14-23(33)15-11-21;1-11(21)17(18(22)23)20-19(24)25-10-16-14-8-4-2-6-12(14)13-7-3-5-9-15(13)16;;/h7-17,25,32-33H,18H2,1-6H3;2-9,11,16-17,20-21H,10H2,1H3;;/q-2;-1;+2;+1/rC50H53N2NaO12Pd/c1-29-16-21-33(22-17-29)49(7)41-25-18-30(2)27-50(41)66(62-44(63-67-50)40(51-46(57)59-48(4,5)6)26-32-19-23-34(55)24-20-32)53(60-45(49)65(53)66)61-47(52-42(31(3)54)43(56)64(53)66)58-28-39-37-14-10-8-12-35(37)36-13-9-11-15-38(36)39/h8-25,27,31,39-40,42,51-52,54-55H,26,28H2,1-7H3
charge 0 multiplicity 1
119 atoms
C  -5.14916892 5.04458593 -0.29461455
C  -4.02462057 4.23260968 -0.20937576
C  -3.31719667 3.85409668 -1.36354703
C  -3.77752809 4.31043455 -2.59820984
C  -4.90883334 5.13063281 -2.67850725
C  -5.61402011 5.51217523 -1.53528925
H  -5.68194099 5.32518049 0.61863813
H  -3.6721825 3.8798966 0.7649618
H  -3.26156181 4.03265176 -3.51865942
H  -5.24973932 5.47869492 -3.65781287
C  -2.08692438 2.95680937 -1.20127329
C  -6.83687929 6.38564063 -1.61791094
H  -6.73278624 7.27995748 -0.98468662
H  -7.02303085 6.7185981 -2.64837938
H  -7.7328475 5.84788067 -1.27054674
C  -1.02012063 3.63217944 -0.34274471
C  -0.03991363 2.87209056 0.33462614
C  -0.92736707 5.02656625 -0.2804365
C  0.95475351 3.52554694 1.08611199
H  0.5777707 1.86009907 -0.3534398
C  0.08019981 5.65400628 0.45449003
H  -1.65992436 5.63773495 -0.81260562
C  1.03521895 4.91804986 1.1668051
H  1.69306802 2.91614961 1.61990753
H  0.1214428 6.74701867 0.47721476
C  -1.45464293 2.56449024 -2.54177065
H  -0.57480188 1.92587022 -2.36725779
H  -1.11548495 3.45815076 -3.08578384
H  -2.18034973 2.00918189 -3.15255576
C  -2.66203775 1.68356689 -0.55256101
O  -2.4580321 1.48475822 0.72148473
O  -3.35268638 0.91847948 -1.22453678
C  2.08798626 5.59410446 2.0024686
H  1.72656784 5.76175312 3.0295451
H  2.99766584 4.98067956 2.0738373
H  2.36300727 6.57423119 1.58736695
Pd -0.54781206 1.00215567 1.04746191
Na -3.03046052 -0.82111219 0.37012653
O  -0.85744832 0.28992426 3.83677001
C  -1.27365901 -0.6606323 3.18826902
O  -1.25760414 -0.74387297 1.89942596
C  -1.90008388 -1.8553829 3.93340414
H  -2.91963887 -1.52512756 4.21136524
N  -2.00099457 -3.06978196 3.15230795
C  -1.08872298 -2.15562147 5.22400644
H  -1.52407795 -3.88736894 3.53206638
C  -2.94363534 -3.26276817 2.21628197
H  -0.02331361 -2.00401864 4.98905367
O  -1.20763088 -3.51538428 5.59060909
C  -1.49207668 -1.24289399 6.36483946
O  -3.72557163 -2.40788834 1.81205789
O  -2.94603646 -4.53338971 1.76583288
H  -2.04330731 -3.63310662 6.0661471
H  -1.37975778 -0.19499213 6.06282793
H  -2.55012782 -1.42128042 6.62689249
H  -0.87217441 -1.4428972 7.24993883
C  -3.80730862 -4.83306245 0.67900257
H  -4.26256519 -5.81098655 0.89064522
H  -4.60161154 -4.07521141 0.62643591
C  -3.05210961 -4.88001234 -0.65882119
C  -2.19969976 -3.6560682 -0.90878522
H  -2.43539914 -5.79370977 -0.69485557
C  -4.05161577 -4.81721738 -1.79326325
C  -1.04959953 -3.23695166 -0.24512548
C  -2.71173653 -2.91411854 -1.99536549
C  -5.07994788 -5.70140846 -2.10533514
C  -3.87347258 -3.63523884 -2.53796723
C  -0.41763049 -2.06000452 -0.66662205
H  -0.64646359 -3.80541247 0.59514984
C  -2.09001382 -1.73085479 -2.40248241
C  -5.92928336 -5.39869747 -3.17578138
H  -5.22263757 -6.62115783 -1.53142147
C  -4.72295802 -3.33232135 -3.60331299
C  -0.93724425 -1.30933789 -1.726882
H  0.46785901 -1.71030429 -0.1333704
H  -2.49640031 -1.13491832 -3.22267851
C  -5.75191863 -4.22425676 -3.91561837
H  -6.73724442 -6.08546128 -3.43711463
H  -4.58627501 -2.41541612 -4.1816835
H  -0.43554465 -0.3837187 -2.02044496
H  -6.42513799 -4.00355212 -4.74678792
O  1.3759504 0.38442653 1.20679857
C  2.03997334 0.54760022 0.14346901
O  1.60014177 1.17018416 -0.86486417
C  3.47531674 0.07275946 0.14362099
H  3.52054593 -0.94771382 0.55298869
C  4.26757514 1.0176424 1.08704153
N  4.00333505 0.03851597 -1.19117695
H  4.07673946 2.05653713 0.76510051
H  3.85877135 0.90375325 2.10266338
C  5.74170661 0.72489888 1.0419203
H  3.74584683 0.77067725 -1.8468967
C  4.91644612 -0.90907172 -1.55603983
C  6.58092113 1.41854511 0.16519696
C  6.29320348 -0.32347115 1.79165574
O  5.249093 -1.83933061 -0.84867733
O  5.37013778 -0.66440246 -2.79401632
C  7.92755804 1.07796685 0.03326348
H  6.17328629 2.23761897 -0.43440038
C  7.63170929 -0.67673024 1.66758388
H  5.65165951 -0.888974 2.47371996
C  6.36830364 -1.51728803 -3.40511887
C  8.45835389 0.01981414 0.77732655
H  8.57249798 1.63102283 -0.65742623
H  8.06043433 -1.49909384 2.2427123
C  5.84028902 -2.94190483 -3.5431537
C  7.66319601 -1.46285866 -2.60042275
C  6.5685482 -0.89208025 -4.7792626
O  9.75173726 -0.36608276 0.66850842
H  6.5486657 -3.53780714 -4.13793139
H  5.71319822 -3.41040242 -2.56004473
H  4.87209631 -2.9344002 -4.06646748
H  7.51310018 -1.85641054 -1.58639181
H  8.43649027 -2.05878848 -3.10813538
H  8.01504479 -0.42245944 -2.52706779
H  6.8986148 0.15198255 -4.67776836
H  7.32967937 -1.45128067 -5.34235128
H  5.62669448 -0.90675628 -5.34670885
H  10.20578977 0.18513765 0.01709363
