program: Gaussian 16
title: mn15/BS1
version: ES64L-G16RevC.01
method: RMN15
basis: GenECP
operation: Freq
keyword: #N
keyword: Geom=AllCheck
keyword: Guess=TCheck
keyword: SCRF=Check
keyword: GenChk
keyword: RMN15/GenECP
keyword: Freq
converged: YES YES NO NO
title: Mulliken charges:
elementType: Pd C O C C C C C H H C O O C H H C C H C H H H C C C C H C H C H H Na C H H H C H H H C H H C H H C O C H H H O C H O C O C H C N H H C H C C C O O C H C H C C H H C C C O H H H H H H H H H H H H
charge: 0.046511 0.153517 -0.270896 -0.010998 -0.041991 0.046234 -0.058286 -0.026288 -0.044777 -0.055563 0.245300 -0.381838 -0.275907 -0.152764 0.060817 0.322217 0.087628 -0.258878 -0.041317 0.206195 0.005605 0.024241 -0.004470 0.016294 0.055603 -0.008898 0.005765 -0.040319 -0.022809 -0.021640 -0.052990 -0.038271 -0.041601 0.440321 0.092045 0.036257 0.021189 0.006435 0.087927 0.005181 0.031651 0.024232 0.135684 0.037071 0.003005 0.047455 0.019675 0.017866 -0.050918 -0.163635 -0.013952 0.022970 0.035859 0.021956 -0.277886 0.085985 0.068201 -0.396430 0.204817 -0.258186 0.051603 0.021123 0.182071 -0.141562 0.015621 0.007476 -0.109378 0.147195 0.215604 0.019826 -0.049285 -0.273757 -0.291052 0.066834 0.024114 -0.028126 0.001005 -0.178347 0.119421 0.006157 -0.024499 0.089928 0.084819 0.084811 -0.174835 0.008733 0.016420 0.015359 0.041231 0.011873 0.005998 0.040387 0.006383 0.009893 0.191733 0.031960 0.043063
chargesum: -0.00000
title: Mulliken charges with hydrogens summed into heavy atoms:
elementType: Pd C O C C C C C C O O C C C C C C C C C C Na C C C C C O C O C O C O C C N C C C C O O C C C C C C C O
charge: 0.046511 0.153517 0.051321 -0.055775 -0.083308 0.046234 -0.113849 -0.026288 0.245300 -0.381838 -0.275907 -0.091947 0.087628 -0.258878 0.231571 0.016294 0.015285 -0.030537 -0.032505 -0.064410 -0.052990 0.440321 0.155926 0.148991 0.175760 0.084996 -0.050918 -0.163635 0.066834 -0.277886 0.229208 -0.396430 0.204817 -0.258186 0.072726 0.205167 0.005634 -0.109378 0.215604 0.043940 -0.048279 -0.273757 -0.291052 0.072990 -0.052624 -0.178347 0.119421 0.130439 0.143921 0.141473 0.016898
chargesum: 0.00000
1716.lowfreq: -1417.3683 -4.5156 -0.4569 -0.0011 -0.0004 0.0005 3.8451 11.2024 12.5286
redmass: 1.0911 5.0486 5.1463 5.1434 4.7749 4.7348 3.5484 3.4238 1.0835 4.2065 4.7045 4.5888 3.7165 4.6916 5.2403 7.7020 6.1022 2.9388 4.4037 5.2900 4.3713 4.9925 4.0806 1.4494 2.7332 3.3470 3.2088 1.7351 4.8057 3.6658 5.5501 6.1168 6.4154 5.8165 6.2147 4.8754 5.8104 7.6889 4.6593 4.1958 1.2717 4.4768 6.5597 5.2165 1.4363 5.8475 3.4616 1.1791 4.4539 3.8055 1.3013 3.1082 4.1830 3.3719 3.6854 3.5974 4.4002 1.2637 3.4829 4.5891 2.9667 2.5863 2.5636 3.8503 2.7728 3.8662 3.4888 1.3343 5.1633 4.4681 4.2086 3.0818 2.7381 3.1426 3.0744 3.1216 2.8908 3.3911 3.5419 3.8343 2.8545 4.2216 3.8807 3.9036 3.4915 1.1557 4.0778 2.8812 4.3311 3.9974 2.7829 4.1086 3.6595 4.3944 6.2992 3.7249 6.0295 5.2996 5.5019 5.8986 4.0133 1.8382 2.6982 3.1333 4.3506 2.7605 4.1588 5.8132 6.8590 2.7197 3.7990 4.8863 1.7511 1.5056 1.8813 1.9540 2.1212 1.4649 2.6195 1.5655 2.6420 2.4074 2.4449 1.5096 1.5144 1.6172 2.7283 1.2048 1.6950 1.8028 1.3681 1.3861 2.7682 1.3640 1.3853 2.2742 1.8691 2.0229 2.4777 1.7041 1.5021 1.4180 1.4758 1.3902 1.4554 1.9172 1.6434 1.6128 2.4262 2.3685 2.0199 2.2469 2.2605 2.5134 3.7116 1.4016 1.3272 1.7930 1.3205 1.3002 1.9573 1.1185 1.7234 1.3100 1.6449 1.1209 1.4474 2.0547 1.8748 2.1175 1.9277 2.2452 1.2465 2.7342 2.1286 2.4528 2.1097 1.2333 1.6293 1.4647 1.8426 1.8339 1.3422 1.3638 2.5097 3.6691 1.3595 5.6260 1.7825 4.3944 1.5477 1.2868 1.6475 1.4021 1.4554 6.0410 1.3101 1.2488 1.2328 1.6459 1.0432 1.0525 1.1096 1.1049 2.8118 1.4880 1.1591 1.4055 1.1623 1.1707 1.0610 1.0537 1.0842 3.0636 1.1614 1.1881 1.0360 1.0758 1.0918 1.9463 2.0638 3.4166 1.0765 1.4467 3.7248 4.1355 3.2003 3.8845 3.1104 7.1446 7.2914 6.9620 7.3843 7.2934 7.2023 7.6655 10.4692 11.9225 11.5116 11.9317 1.0680 1.0392 1.0665 1.0384 1.0364 1.0374 1.0376 1.0383 1.0366 1.0635 1.0371 1.0836 1.0958 1.1007 1.0987 1.1025 1.1075 1.1043 1.1041 1.1043 1.1046 1.1031 1.0925 1.1031 1.1050 1.1047 1.1046 1.1040 1.0879 1.1004 1.0888 1.1036 1.0905 1.1031 1.0947 1.0912 1.0951 1.0928 1.0953 1.0840 1.1091 1.0964 1.0919 1.0783 1.0662
irintensity: 1808.6459 0.3695 0.5703 0.4754 0.3994 0.3920 0.4694 0.8027 0.3719 0.3842 0.4599 1.2878 0.1699 0.8534 5.5726 0.8462 1.8434 1.1206 0.2525 1.6484 3.3957 0.7595 2.1472 0.2294 1.1329 0.5393 1.5093 4.2370 0.6454 0.3762 4.8586 3.6081 0.4520 2.9594 2.7067 3.8818 2.0433 4.4211 9.3304 0.8185 1.0341 15.5510 10.9232 3.5383 1.8222 2.9017 0.5488 0.2664 1.0741 5.3435 1.8220 9.5762 8.5570 2.0613 4.9040 15.5142 11.0786 100.1240 10.2270 10.5615 7.3353 2.2681 5.4820 1.9200 0.6987 0.2887 2.1719 6.1622 36.4395 7.4418 11.9394 7.4649 8.2413 4.0761 2.1648 5.0452 1.9089 6.7786 4.8074 1.2552 9.4485 19.6076 4.1167 4.2264 1.1959 83.9643 8.5346 27.8809 9.7115 12.8163 3.2310 18.2831 29.8673 2.5977 1.9644 0.5706 2.5417 58.1315 5.5242 43.9494 4.5392 5.7096 3.6288 7.9713 18.5446 1.2953 3.9134 20.5235 4.7980 22.4629 5.1130 4.7580 4.0459 17.1729 18.9835 6.8174 6.4181 1.3944 7.7392 28.2024 17.1398 36.9248 5.1660 0.8166 4.2017 1.8905 30.0945 0.3115 19.9378 13.3701 0.1567 2.7061 6.1368 1.6827 1.4107 5.1095 1.5481 0.4727 4.9349 2.8209 0.1726 0.1445 1.7409 17.1477 2.6364 8.3092 3.8026 4.2632 14.8480 2.3007 5.5398 9.0532 1.5877 5.2064 71.2645 10.7690 5.5934 3.5315 5.6649 86.8684 37.0797 18.8756 54.7353 5.4683 65.0680 2.0494 7.5306 88.8430 151.7091 2.1909 7.7069 226.7276 8.7969 0.0293 6.5363 5.3051 43.6274 3.2360 11.7773 10.3298 150.7219 4.3108 2.6977 8.6631 11.9080 20.0218 0.1288 9.0775 24.9583 20.9496 28.7891 7.0326 22.6007 3.7893 5.6087 14.5040 68.4416 13.1034 13.1781 6.0161 0.3136 22.4571 6.8110 78.4156 432.9690 41.4299 4.6876 230.8730 94.1997 7.1197 1.3478 0.6721 1.7894 343.1323 4.6191 12.3104 6.3254 0.5672 11.7218 26.3668 15.3904 11.9391 5.2140 143.3692 22.9817 1124.5345 31.4145 48.5522 191.0112 7.5271 0.2156 12.3090 20.3523 41.7599 17.2039 623.0849 161.0458 299.1045 264.5289 108.3433 10.2345 27.0841 17.1959 27.2901 9.1141 19.3835 16.6868 20.5386 13.6357 3.6896 1.6961 28.5463 5.1712 13.0133 4.3601 10.0595 3.0580 7.7012 25.2598 16.0296 10.0975 29.2631 6.6582 17.5069 19.2014 30.7898 10.8921 16.2580 12.0871 2.6523 8.0244 2.3395 20.3519 4.7950 2.9561 14.6306 3.0350 0.6517 1.3987 4.0692 3.5773 0.6439 6.8633 81.2395 111.3874
temp: 333.150 k
press: 1.00000 atm
elementType: 46 6 8 6 6 6 6 6 1 1 6 8 8 6 1 1 6 6 1 6 1 1 1 6 6 6 6 1 6 1 6 1 1 11 6 1 1 1 6 1 1 1 6 1 1 6 1 1 6 8 6 1 1 1 8 6 1 8 6 8 6 1 6 7 1 1 6 1 6 6 6 8 8 6 1 6 1 6 6 1 1 6 6 6 8 1 1 1 1 1 1 1 1 1 1 1 1
symmnumber: 1
zpe: 2050062.3 jmol-1
zpe.correction: 0.780827 hartree
zpe.thermalcorrener: 0.846852 hartree
zpe.thermalcorrenthalpy: 0.847907 hartree
zpe.thermalcorrgfe: 0.669673 hartree
zpe.sumelectzpe: -2567.452715 hartree
zpe.sumelectthermal: -2567.386690 hartree
zpe.sumelectthermalent: -2567.385635 hartree
zpe.sumelectthermalfe: -2567.563869 hartree
dipole: 0.7198 0.3632 -0.3905
dipole: 0.8959
quadrupole: -291.1685 -285.9828 -312.4626
quadrupole: -7.5184 5.1026 -5.3998
quadrupole: 5.3695 10.5552 -15.9247 -7.5184 5.1026 -5.3998
hfenergy: -2568.2335425 hartree
pointgroup: C01 [X(C38H46N1Na1O10Pd1)]
dipole: 0.2832039 0.1429059 -0.153617 debye
polarizability: 537.8648106|16.62811|478.5175574|15.8944269|-3.5769731|431.7283556 unknown
InChI: InChI=1/C22H25O3.C14H18NO5.C2H3O2.Na.Pd/c1-5-19(23)12-9-17-14-16(3)8-13-20(17)22(4,21(24)25)18-10-6-15(2)7-11-18;1-14(2,3)20-13(19)15-11(12(17)18)8-9-4-6-10(16)7-5-9;1-2(3)4;;/h6-8,10-11,13-14H,5,9,12H2,1-4H3;4-7,11,15-16H,8H2,1-3H3;1H3;;/q-1;;-1;2*+1/rC38H46NNaO10Pd/c1-9-28(42)22-37-31-20-24(3)12-19-30(31)36(8,27-15-10-23(2)11-16-27)38-40(48-38)49(51(37,52-37,50(38)40)47-25(4)41)33(44)32(39-34(45)46-35(5,6)7)21-26-13-17-29(43)18-14-26/h10-20,32,37,39,43H,9,21-22H2,1-8H3
charge 0 multiplicity 1
97 atoms
Pd 0.36838716 -0.75117815 -0.1667638
C  0.40806829 -3.1130265 1.23057059
O  1.33555483 -2.51423424 1.83846837
C  3.43229777 -1.77135408 -3.87376453
C  3.24101752 -0.42774751 -3.54725546
C  2.83499405 -1.00812403 -1.2447049
C  3.03777732 -2.35070635 -1.59365534
C  3.33057369 -2.76360772 -2.89663969
H  3.66457536 -2.04719352 -4.90596519
H  2.93894451 -3.10559784 -0.80416228
C  1.24461031 1.76212044 -1.6859098
O  0.66273935 1.17280911 -0.69340395
O  0.61354558 2.56862161 -2.38116692
C  2.5179549 -0.70546277 0.19339994
H  2.42231283 0.3647906 0.37887406
H  1.67614474 -1.53474681 0.98299064
C  2.94026508 -0.00554584 -2.24570881
C  2.74057797 1.49568208 -1.95349149
H  3.33634996 0.30907106 -4.34472203
C  3.169476 2.38593331 -3.12764959
H  3.04685617 3.43789879 -2.83823271
H  2.54891445 2.21661995 -4.01749626
H  4.22762464 2.20733391 -3.36955568
C  3.55866181 1.95914171 -0.74173889
C  3.06127627 2.91959597 0.15070309
C  4.85262319 1.47305591 -0.53362749
C  3.80428328 3.31204701 1.26106763
H  2.07207031 3.35944453 -0.00314852
C  5.59648891 1.87373007 0.57954444
H  5.27050345 0.74390302 -1.23518372
C  5.07523314 2.77681625 1.51341478
H  3.37680592 4.03959442 1.95703709
H  6.60029997 1.46445865 0.73275474
Na -1.38966723 1.78290817 -1.38960311
C  3.50578425 -4.22153211 -3.22404899
H  2.54548763 -4.75686945 -3.15979699
H  4.19582501 -4.71030389 -2.52007099
H  3.89861412 -4.35984322 -4.24086748
C  5.83150513 3.14189484 2.76210153
H  6.87300614 2.79207723 2.71953935
H  5.35909577 2.68594125 3.64783212
H  5.84123477 4.22966695 2.926907
C  3.62034888 -1.15966906 1.16078305
H  3.61897114 -2.24256576 1.36080934
H  4.60532228 -0.93076361 0.71515522
C  4.66349151 -0.62807959 3.4665967
H  4.33394463 -0.19078152 4.42009788
H  5.502449 -0.00701578 3.10037245
C  3.5309579 -0.41775429 2.4811792
O  2.61990882 0.34669627 2.72220568
C  5.11396627 -2.07681032 3.62717296
H  5.56726531 -2.46820415 2.70433638
H  4.26614181 -2.72827505 3.88794765
H  5.86554948 -2.16554094 4.4240881
O  -0.07989369 -2.66352337 0.15164289
C  -0.1873135 -4.36822774 1.7890359
H  -1.14378372 -4.07647142 2.24857983
O  -1.60355836 -0.3674356 -0.59713988
C  -2.47742388 -0.71132075 0.30184023
O  -2.28094291 -1.3767422 1.30771048
C  -3.86977327 -0.10664429 0.09810149
H  -3.99145619 0.26355213 -0.93298215
C  -4.04063749 1.06839043 1.09019448
N  -4.84865935 -1.13600789 0.34152921
H  -5.04511177 1.48670826 0.92638674
H  -4.00063025 0.6296474 2.09959785
C  -2.98170266 2.1278326 0.94514273
H  -4.58898157 -1.88711662 0.97757218
C  -6.14173405 -0.96512812 -0.04240114
C  -1.72804933 1.97522623 1.56981604
C  -3.1730232 3.25059708 0.12802256
O  -6.53021213 -0.00671874 -0.68733189
O  -6.90165697 -1.98712369 0.37706897
C  -0.69925768 2.89000375 1.37625451
H  -1.54805651 1.09517173 2.19483089
C  -2.14166873 4.17902117 -0.08045097
H  -4.14271531 3.40666786 -0.35445552
C  -8.31634063 -2.04931126 0.07736097
C  -0.89675836 3.99668478 0.53715729
H  0.28212077 2.73318499 1.83054449
H  -2.30658933 5.05199675 -0.71940297
C  -8.75638976 -3.35048397 0.73479808
C  -8.53201952 -2.11388747 -1.43119142
C  -9.04108646 -0.86297817 0.70513965
O  0.14272826 4.84045802 0.34858074
H  -9.83183953 -3.51217988 0.57267251
H  -8.20202729 -4.1989555 0.30839227
H  -8.56249006 -3.31543592 1.81662776
H  -8.21328516 -1.18005907 -1.91028422
H  -7.96018688 -2.95175886 -1.85783264
H  -9.59874204 -2.28069874 -1.64287445
H  -8.73023356 0.0773778 0.23385101
H  -10.126859 -0.98698474 0.57773056
H  -8.82366844 -0.81615782 1.78301653
H  -0.05401932 5.47809187 -0.35173948
H  0.46653847 -4.81368748 2.54595147
H  -0.40840895 -5.07632555 0.98145505
