program: Gaussian 16
title: freeze ts7a (R,R) C(sp3)-H insertion via MPAA
version: ES64L-G16RevC.01
method: RMN15
basis: GenECP
operation: Freq
keyword: #N
keyword: Geom=AllCheck
keyword: Guess=TCheck
keyword: SCRF=Check
keyword: GenChk
keyword: RMN15/GenECP
keyword: Freq
converged: YES YES NO YES
title: Mulliken charges:
elementType: Pd C O C C C C C H H C O O C H H C C H C H H H C C C C H C H C H H Na C H H H C H H H C H H C H H C O C H H H O C C C C H H H H H H H H H N C C H C O O H H C C C C H C H C H H O H
charge: 0.021251 0.305988 -0.297109 0.000808 -0.043442 0.088745 -0.062755 -0.038221 -0.041202 -0.057149 0.253095 -0.373075 -0.324186 -0.176279 0.040028 0.330681 0.079960 -0.258353 -0.035772 0.202975 -0.000884 0.010346 0.015563 0.007351 0.059072 0.010319 -0.015143 -0.012938 -0.017407 -0.020804 -0.062219 -0.034599 -0.039078 0.519547 0.104647 0.015141 0.003835 0.034096 0.097385 0.015717 0.010707 0.029395 0.133325 0.040480 -0.000811 0.011649 0.005523 0.023533 -0.038189 -0.164560 0.049167 0.027220 0.008170 0.007213 -0.267077 -0.196617 0.101373 0.092664 0.093262 0.027964 0.025488 0.015812 0.022097 0.037716 0.012329 0.015615 0.018807 0.025605 -0.277966 0.022612 0.203103 0.040089 0.172450 -0.397808 -0.228518 0.025701 -0.014265 -0.083443 0.033498 0.074790 -0.104329 0.002749 0.070930 -0.067803 0.146995 -0.000173 -0.057652 -0.239667 0.204910
chargesum: -0.00000
title: Mulliken charges with hydrogens summed into heavy atoms:
elementType: Pd C O C C C C C C O O C C C C C C C C C C Na C C C C C O C O C C C C N C C C O O C C C C C C O
charge: 0.021251 0.305988 0.033573 -0.040394 -0.079213 0.088745 -0.119905 -0.038221 0.253095 -0.373075 -0.324186 -0.136251 0.079960 -0.258353 0.228000 0.007351 0.046134 -0.010485 -0.049742 -0.056485 -0.062219 0.519547 0.157718 0.153204 0.172995 0.040705 -0.038189 -0.164560 0.091769 -0.267077 -0.196617 0.170637 0.164806 0.153289 -0.277966 0.062701 0.203103 0.183886 -0.397808 -0.228518 -0.083443 0.036248 0.006987 -0.104502 0.013279 0.146995 -0.034757
chargesum: 0.00000
1716.lowfreq: -1484.8837 -2.8374 -0.0003 0.0003 0.0005 4.2826 7.9494 24.5791 33.5199
frequency: -1484.8837 24.5518 33.4670 36.2358 43.0375 46.5611 49.7561 50.2405 54.0717 56.9694 68.1459 70.2671 71.9496 77.8835 86.7669 92.6642 97.1970 99.6352 104.0504 116.5423 126.1875 127.9533 132.1120 139.8038 151.7837 154.6096 166.6262 167.9882 174.2595 180.0132 191.5758 194.5556 204.1229 209.6896 217.3314 222.8570 226.2600 229.0714 234.8216 245.7495 253.6050 255.7940 263.6089 270.5238 281.5140 289.3898 292.7465 315.4404 320.0503 328.6245 343.3392 346.4324 349.8445 352.5384 356.6481 365.9626 382.4075 387.3146 395.1165 404.3476 409.1524 417.6933 421.6719 425.8586 437.3852 439.9765 445.4919 449.9443 454.9912 456.2522 464.9476 474.8173 477.3872 486.7343 517.8902 523.8252 544.7987 575.8679 580.5972 587.4154 588.1356 613.8290 627.9572 635.4986 637.6806 657.0070 668.2410 710.7512 721.5564 729.6062 740.5576 743.0509 746.1689 750.6370 755.4931 766.7134 772.7894 791.0122 810.5042 820.1441 830.9980 838.2964 846.3383 856.4395 859.9114 862.2011 865.4387 885.1524 887.6310 896.3255 898.9666 917.7677 920.2853 920.8783 924.6943 928.0239 938.1238 954.3437 962.6761 979.5022 985.3788 991.0260 992.1551 1000.0310 1002.0484 1004.7944 1010.4486 1011.2670 1016.3058 1021.7049 1024.7091 1027.7746 1028.7143 1037.9818 1042.7056 1044.7595 1061.4226 1074.9171 1087.9122 1094.2447 1109.2530 1122.4857 1124.4344 1125.0394 1138.5996 1153.0085 1155.0954 1166.6529 1178.2635 1185.9419 1192.7467 1207.5629 1213.9414 1221.5016 1221.6714 1231.1388 1236.2813 1240.1368 1243.8686 1252.4645 1255.5303 1265.5793 1275.0183 1279.9491 1293.1763 1296.9657 1305.2501 1305.6132 1308.5708 1325.1990 1341.8318 1345.3536 1352.4325 1365.1010 1366.1948 1367.0633 1372.1584 1372.5349 1374.8364 1378.4348 1379.6670 1382.7567 1390.8491 1394.7190 1402.6701 1412.5628 1412.6322 1423.1353 1423.9361 1428.0914 1430.8464 1432.7496 1432.9003 1434.3301 1435.9592 1436.5732 1442.4205 1443.5007 1448.7156 1448.7378 1450.4089 1455.7594 1462.5784 1464.3667 1467.5651 1477.7222 1535.1770 1551.4520 1564.6348 1597.0280 1641.6107 1649.8965 1653.1109 1681.0078 1690.8314 1699.8469 1705.0664 1729.2146 1848.8956 1851.0761 3066.5499 3068.1928 3069.9353 3072.6576 3073.7401 3080.1040 3083.2953 3083.8459 3085.7924 3096.1661 3111.3679 3119.7195 3123.5155 3148.9133 3153.2959 3163.9214 3169.9334 3176.7826 3177.3438 3178.2939 3179.4561 3182.7975 3183.4330 3188.7464 3188.8435 3189.3165 3190.2672 3190.6477 3196.5754 3197.1189 3200.8705 3206.9961 3212.7218 3215.8423 3216.6642 3218.5070 3219.7040 3255.4336 3268.7359 3271.5757 3665.2432
redmass: 1.0948 4.6615 4.1962 4.3645 5.7859 1.1987 3.3207 3.3340 4.3947 4.7662 4.3313 2.8289 3.7530 5.3439 6.4426 3.4532 6.9354 1.8228 5.8526 4.7441 5.3327 2.3830 3.9579 7.3458 4.6647 5.3496 5.5319 4.0828 4.6691 5.8722 4.1685 7.0855 7.4616 2.0956 2.7317 4.0856 2.7804 1.9582 2.8308 1.8246 4.2334 3.2062 1.7994 2.5056 3.7054 1.1280 4.2353 4.6370 3.3050 5.8866 4.9664 2.7900 4.1749 3.2414 2.8682 2.9415 3.6183 3.9561 2.7057 5.9535 2.9716 2.0020 2.5276 3.2123 3.1843 3.5310 3.4475 2.6004 2.9637 2.7140 3.3206 3.9705 1.6081 3.7753 3.8469 3.3431 3.2845 3.6692 4.2453 4.7803 3.4991 3.9618 3.4192 6.7008 6.0321 3.6948 5.4196 2.9132 2.7333 3.1311 3.9737 3.7531 2.8105 3.7633 4.3510 5.1723 5.6395 3.0868 4.1560 4.9535 3.2000 1.5127 1.5613 2.2811 2.1197 1.2728 2.1073 1.9898 2.3362 2.2026 2.6714 1.5694 1.6970 2.1270 1.5759 2.5903 1.2041 2.8656 2.0405 1.3907 1.3843 1.3706 1.3917 1.5582 2.2174 1.9527 1.8859 1.4190 2.7081 1.4891 1.4197 2.2799 1.8527 1.6285 1.6057 1.4632 2.1331 2.2688 2.5688 1.2348 1.4762 1.4731 1.7334 2.0489 1.8555 1.1286 1.9591 1.6828 1.2584 1.0972 1.3952 2.9415 2.1737 2.1741 1.8108 1.6134 1.6070 1.9110 1.4010 1.4924 2.4141 2.1629 2.1264 1.8622 2.0153 1.7282 1.4268 1.3597 1.6150 2.1687 2.3698 2.2193 5.8292 1.3665 1.7947 1.5982 2.1631 2.3868 1.3276 1.3881 1.4625 1.3042 1.1748 1.7546 3.9801 1.2372 1.1441 1.3871 1.4038 1.1694 1.1257 1.0529 1.0905 1.0590 1.0597 1.0508 1.1996 1.2641 1.2125 1.1024 1.4582 3.3816 2.9028 2.3567 1.1510 1.2464 3.5413 3.1901 3.8451 4.4665 7.1625 7.1905 7.3702 10.2758 7.2899 7.1876 7.7117 8.2014 12.6663 11.8697 1.0584 1.0431 1.0388 1.0631 1.0374 1.0366 1.0375 1.0360 1.0385 1.0616 1.1006 1.1008 1.0860 1.1020 1.1018 1.1066 1.1036 1.1041 1.1042 1.1038 1.1044 1.1050 1.1048 1.0897 1.1041 1.1037 1.0817 1.1045 1.0912 1.1045 1.0882 1.0909 1.0952 1.0917 1.1033 1.0952 1.0916 1.0935 1.0931 1.0918 1.0665
irintensity: 2242.9531 0.3373 0.6142 0.2291 1.7901 0.2611 0.8842 0.0040 1.0043 0.6568 1.9436 0.2737 0.6157 0.2769 2.4982 1.5898 2.7940 1.8634 9.8714 3.8896 2.8719 3.2374 6.4635 0.5305 1.0401 1.6451 1.8393 0.0864 0.1792 3.4211 1.5957 11.0197 9.4459 1.8670 5.4413 3.5468 2.7253 0.7327 1.3008 0.2619 6.3833 0.2263 1.7234 2.9595 1.9845 0.0389 3.9526 20.7341 2.3671 11.9882 15.7062 12.2263 26.1388 14.1710 8.7153 0.4691 11.1980 2.5078 1.4693 15.0346 8.1116 9.8189 7.7519 34.2318 26.3770 6.0117 9.6064 2.7831 9.9895 9.3580 2.4568 32.9237 147.6127 19.2625 1.8822 6.9022 5.9180 14.7665 16.2400 15.8770 10.1583 24.0074 4.3289 0.4282 2.9527 3.3580 13.2026 34.6400 0.7801 8.0768 0.7796 8.0618 9.0622 8.1719 14.8991 10.1894 13.3485 10.3211 0.5330 0.8539 19.9762 13.4980 18.2088 3.9164 9.0086 1.6564 6.3474 5.8426 12.8844 20.1256 47.3976 0.6858 2.3841 6.7359 2.4740 17.0910 0.1426 0.8245 1.3187 2.4391 1.9545 0.8992 0.4721 0.5416 6.9579 12.8492 6.1939 0.5014 10.8273 1.4173 0.7868 22.1759 13.4043 9.9350 2.5590 13.2864 0.5026 8.4818 2.9380 6.2206 2.5708 21.3120 28.3733 7.6488 1.2610 4.6161 6.0696 25.2213 14.9967 10.5531 21.0488 163.3458 134.8919 18.2946 4.9791 17.7889 56.1872 10.2461 103.3803 0.7183 6.0877 12.7999 22.6536 2.5142 21.3871 3.7429 15.3713 19.0721 10.8267 18.3387 13.8666 6.4554 4.8464 12.8558 23.5884 9.2036 54.9642 26.7748 9.9658 1.4486 16.6280 50.5459 28.5352 80.2945 466.5407 6.6947 4.5770 1.7168 1.3254 9.8284 19.1886 5.9494 6.2528 0.3613 1.9762 5.6771 13.3013 29.2691 27.7245 2.0587 61.8423 4.3806 107.6973 2.1122 10.9194 191.4879 25.1409 41.8406 95.7374 307.5745 8.1267 1.0725 3.4982 410.7919 25.6783 3.0816 178.0312 344.6774 686.7061 41.9800 2.5689 44.0777 26.1975 15.5802 8.5258 11.1352 21.4261 12.7560 16.1748 14.7037 1.1933 7.7535 16.2085 15.8201 10.2128 4.6021 13.7077 19.3009 9.7537 9.4839 11.7008 19.4970 9.7392 8.2820 11.8368 7.1370 16.2575 16.0623 4.6428 16.6197 10.8757 3.6154 2.6818 14.2200 4.5489 3.3774 12.2881 1.7521 7.4434 3.6942 315.3490
temp: 333.150 k
press: 1.00000 atm
elementType: 46 6 8 6 6 6 6 6 1 1 6 8 8 6 1 1 6 6 1 6 1 1 1 6 6 6 6 1 6 1 6 1 1 11 6 1 1 1 6 1 1 1 6 1 1 6 1 1 6 8 6 1 1 1 8 6 6 6 6 1 1 1 1 1 1 1 1 1 7 6 6 1 6 8 8 1 1 6 6 6 6 1 6 1 6 1 1 8 1
symmnumber: 1
zpe: 1883949.1 jmol-1
zpe.correction: 0.717558 hartree
zpe.thermalcorrener: 0.775381 hartree
zpe.thermalcorrenthalpy: 0.776436 hartree
zpe.thermalcorrgfe: 0.623493 hartree
zpe.sumelectzpe: -2338.864852 hartree
zpe.sumelectthermal: -2338.807029 hartree
zpe.sumelectthermalent: -2338.805974 hartree
zpe.sumelectthermalfe: -2338.958917 hartree
dipole: -0.6599 2.8886 3.4182
dipole: 4.5237
quadrupole: -279.0770 -272.8494 -296.8253
quadrupole: 7.7336 11.1802 18.5884
quadrupole: 3.8403 10.0678 -13.9080 7.7336 11.1802 18.5884
hfenergy: -2339.58241 hartree
pointgroup: C01 [X(C36H42N1Na1O8Pd1)]
dipole: -0.2568034 1.1443845 1.3386372 debye
polarizability: 460.8532965|-0.2456665|433.234216|-6.3475625|9.5896796|422.5623715 unknown
InChI: InChI=1/C36H42NO8.Na.Pd/c1-8-26(38)21-31(28-19-23(3)11-18-29(28)36(7,33(42)43)25-14-9-22(2)10-15-25)46-45-34(44-35(4,5)6)37-30(32(40)41)20-24-12-16-27(39)17-13-24;;/h9-19,30-31,39H,8,20-21H2,1-7H3;;/q-2;2*+1/rC36H42NNaO8Pd/c1-8-26(39)21-36-29-19-23(3)11-18-28(29)35(7,25-14-9-22(2)10-15-25)32-43-38-45-31(41)30(20-24-12-16-27(40)17-13-24)37(47(36,38,45)46(32)38)33(44-48-36)42-34(4,5)6/h9-19,30,36,40H,8,20-21H2,1-7H3
charge 0 multiplicity 1
89 atoms
Pd 0.41954152 -0.0728408 -1.19501632
C  2.28055488 1.86556196 -0.26176988
O  1.31827677 2.22474115 0.48805557
C  -0.68292217 -1.39142403 4.07730356
C  -1.37880664 -1.94144748 2.99953647
C  -0.84207446 -0.02965649 1.62603178
C  -0.1548803 0.50648496 2.72568695
C  -0.06099182 -0.14551984 3.95962523
H  -0.62362434 -1.94499204 5.01822475
H  0.32547083 1.48278556 2.60581969
C  -1.46428946 -2.3518911 -0.51562177
O  -1.06715611 -1.50002654 -1.39091568
O  -1.14242277 -3.55322543 -0.6136588
C  -0.89901609 0.77852561 0.36022863
H  -1.58634875 0.30228154 -0.34382028
H  0.37772749 1.40562734 0.22497594
C  -1.48835017 -1.28621489 1.76565672
C  -2.37187276 -1.89256458 0.64834361
H  -1.84356926 -2.9161981 3.14084866
C  -3.14156121 -3.13065011 1.1352357
H  -3.79999957 -2.8607104 1.97340484
H  -3.76375019 -3.51444233 0.3146687
H  -2.46020059 -3.93232718 1.44787279
C  -3.43617137 -0.87399812 0.20843464
C  -3.86058179 -0.72026775 -1.11598724
C  -4.08513334 -0.1111494 1.1930
C  -4.8610889 0.19833169 -1.44678508
H  -3.38460361 -1.2902819 -1.9147929
C  -5.08821177 0.79630802 0.86057025
H  -3.78345879 -0.22343575 2.23887916
C  -5.48978004 0.97882694 -0.47187341
H  -5.15238927 0.31374202 -2.49467158
H  -5.56969478 1.37913198 1.65213387
Na 0.45390789 -2.99182791 -2.31035073
C  0.66836311 0.4878335 5.11368923
H  1.03654538 -0.26834406 5.82123087
H  1.52630322 1.08197313 4.76504887
H  0.0070008 1.16845019 5.67368977
C  -6.56121546 1.97525466 -0.82675995
H  -6.27474173 2.99691094 -0.52839782
H  -6.75461498 1.98587778 -1.90858319
H  -7.50784741 1.7439434 -0.31446735
C  -1.54034763 2.16433253 0.54089399
H  -0.843808 2.93779273 0.91004676
H  -2.34482736 2.10049111 1.29385456
C  -3.14631259 3.79640817 -0.64866274
H  -3.90460147 3.4852889 0.09140477
H  -2.63098258 4.65920282 -0.18996801
C  -2.14268371 2.6672171 -0.75533746
O  -1.84621968 2.18336816 -1.82899915
C  -3.77459513 4.14635193 -1.98530815
H  -3.00807329 4.45633237 -2.70877585
H  -4.27548455 3.26330583 -2.40994704
H  -4.5123146 4.9549065 -1.88349341
O  3.47927934 2.42428582 -0.17636756
C  3.89453913 3.26346607 0.93718995
C  3.78646207 2.47252099 2.23686015
C  3.08341411 4.55302602 0.96845642
C  5.35283718 3.55788085 0.61419658
H  2.74345599 2.20356347 2.45649208
H  4.38971298 1.5531455 2.17163453
H  4.1751222 3.07754443 3.06897348
H  3.11440568 5.03973448 -0.01751428
H  2.03855482 4.36141124 1.238999
H  3.52448509 5.24016246 1.70570046
H  5.79571535 4.18291434 1.40255556
H  5.92406449 2.62060437 0.54253814
H  5.43091965 4.08898901 -0.34507044
N  2.11456544 0.91749874 -1.15358251
C  3.21203471 0.28501782 -1.86754579
C  2.64111161 -0.71977734 -2.87092427
H  3.82024266 1.02933942 -2.40511649
C  4.13409355 -0.53766004 -0.92744073
O  1.37007644 -1.00025825 -2.70315115
O  3.35638017 -1.29048897 -3.66885919
H  4.91775015 -0.98137566 -1.55983716
H  4.60981558 0.15174117 -0.21285052
C  3.34514701 -1.60021017 -0.20775339
C  3.09651491 -2.84897794 -0.79884912
C  2.70944914 -1.31670451 1.0082223
C  2.18204803 -3.74254732 -0.23289424
H  3.61012727 -3.10285395 -1.73201234
C  1.80308425 -2.20484249 1.58442999
H  2.89428944 -0.35649304 1.50298133
C  1.49039482 -3.40701813 0.94343947
H  2.00669808 -4.7295376 -0.67616518
H  1.29005511 -1.9621628 2.51512182
O  0.54413782 -4.22668856 1.46944976
H  -0.15714907 -4.34073364 0.79508211
