program: Gaussian 16
title: MN15/BS1
version: ES64L-G16RevC.01
method: RMN15
basis: GenECP
operation: Freq
keyword: #N
keyword: Geom=AllCheck
keyword: Guess=TCheck
keyword: SCRF=Check
keyword: GenChk
keyword: RMN15/GenECP
keyword: Freq
converged: YES YES NO YES
title: Mulliken charges:
elementType: C C C C C C H H H H C C H H H C C C C C H C H H C H H H C O O C H H H Pd Na C H C H H C O O C H O C H H H C H H H C H H H
charge: -0.009416 -0.010422 -0.000365 0.087940 0.021649 -0.060484 -0.039183 -0.031996 -0.020343 -0.032324 -0.223008 0.094591 0.032599 0.004587 0.021444 0.094787 -0.110558 -0.025225 0.007536 -0.005747 -0.036182 -0.030541 -0.030531 -0.036192 0.169202 0.013556 0.005203 0.038775 0.193646 -0.342306 -0.295607 0.087926 0.041070 0.016458 0.016609 -0.317266 0.550622 0.016937 0.015686 0.223920 0.061951 0.051279 0.139837 -0.299116 -0.412885 0.119947 -0.008366 -0.270063 0.013224 0.244064 -0.002880 -0.004253 0.038730 0.009949 0.000984 0.024435 0.051801 0.034212 0.039071 0.071034
chargesum: -0.00000
title: Mulliken charges with hydrogens summed into heavy atoms:
elementType: C C C C C C C C C C C C C C C C O O C Pd Na C C C O O C O C C C
charge: -0.048600 -0.042418 -0.000365 0.067596 -0.010676 -0.060484 -0.223008 0.153220 0.094787 -0.110558 -0.061407 -0.022996 -0.041939 -0.030541 0.226737 0.193646 -0.342306 -0.295607 0.162064 -0.317266 0.550622 0.032623 0.337150 0.139837 -0.299116 -0.412885 0.111581 -0.025999 0.006091 0.074098 0.196117
chargesum: 0.00000
1716.lowfreq: -318.5727 -1.5628 -0.0004 0.0004 0.0008 1.9873 8.6994 25.1729 28.8463
frequency: -318.5727 25.1635 28.8374 31.1794 39.0359 48.5375 52.2724 55.0763 68.3420 73.8359 79.0565 94.3159 96.6705 104.2239 112.8148 116.3628 133.3805 134.3247 150.5382 155.0595 165.0051 183.9091 188.8995 200.2388 209.0856 229.0514 232.2743 248.4957 251.5340 260.1304 275.7951 283.9158 289.0489 319.0354 323.3268 327.0344 333.8587 351.7486 357.1074 365.0065 396.1545 401.9859 412.1568 418.3999 435.0428 448.9863 463.2987 475.2411 498.0730 521.2480 565.0943 572.8044 612.3284 615.7677 619.6369 635.4424 637.5051 664.1450 675.4647 697.7148 730.6373 738.2747 766.8310 776.1729 781.6358 818.2247 839.4292 840.7584 844.0178 856.5217 860.1360 878.9156 890.7304 905.5892 909.4676 921.5698 967.0547 969.8457 976.7561 983.9954 987.1927 996.7736 999.3004 1004.3907 1006.5190 1018.5319 1020.1391 1041.3382 1041.5498 1043.7094 1077.2031 1079.8783 1082.2383 1089.9780 1106.7249 1117.0222 1126.3893 1137.2577 1161.6461 1181.6486 1184.3130 1207.2966 1227.6207 1240.9244 1242.0719 1254.2813 1264.7298 1281.1188 1290.2610 1304.5505 1320.9471 1325.8819 1342.1170 1358.2147 1359.4921 1360.7833 1366.1943 1378.5064 1379.4871 1387.3734 1403.9383 1407.9182 1413.5003 1418.6483 1425.6471 1425.7759 1430.1215 1433.8223 1433.9967 1436.6167 1440.1780 1444.1149 1448.4285 1452.2430 1454.8423 1459.1474 1461.2003 1514.3132 1553.5223 1627.1162 1652.0201 1680.5998 1700.4469 1730.0028 1766.0764 2991.9549 3060.0709 3069.8606 3074.0129 3074.2337 3078.4720 3081.9746 3119.6591 3124.4163 3152.7845 3158.7951 3163.0162 3173.2780 3173.8909 3178.1629 3182.2855 3183.5687 3185.7746 3187.7487 3203.4152 3205.0457 3217.7157 3220.5041 3222.1658 3227.3805 3247.4754 3252.0792 3273.7883 3699.3304
redmass: 7.2295 4.1214 3.3478 1.0903 3.9864 4.4750 1.1076 3.8930 4.3120 3.2481 3.0510 3.7898 4.9810 2.7175 1.8100 2.4332 6.8955 4.9061 5.1597 5.5398 4.9106 6.3070 6.8837 6.6815 2.7773 2.9520 2.7193 3.4492 3.7986 7.2487 3.5671 3.8131 3.9822 4.6993 2.6328 5.3457 5.7716 1.6930 2.7666 3.2554 3.4419 4.0469 4.4960 2.8696 5.3917 3.1172 3.8455 2.5971 4.0052 3.7654 3.1565 3.7525 3.5419 2.5977 2.6586 6.2349 2.5381 6.6138 5.1103 1.1557 3.5467 2.8648 3.8112 1.4632 2.7461 5.5958 2.1734 1.6610 1.8231 2.4427 1.3025 1.9374 2.0083 1.4226 1.4845 2.3762 4.8773 1.8699 1.3761 1.3782 1.4232 1.5395 1.3907 1.5356 1.4119 2.6672 3.0635 1.6223 1.6059 2.0335 1.8583 1.7436 2.1956 1.6278 1.6643 1.5432 1.2833 1.7177 1.4622 1.8781 1.1052 2.1361 1.6457 1.9929 1.2636 5.0342 2.7155 1.8201 1.2715 1.2982 1.2856 1.3891 3.5133 2.9542 1.5057 1.5849 1.5803 1.3660 1.4572 1.5318 1.0862 2.2199 1.3647 1.1580 1.2769 1.7583 2.2731 1.0591 1.1434 1.0575 1.0471 1.2631 1.9545 1.2100 2.2923 1.5104 1.3718 3.9516 3.2511 6.5667 7.2785 7.4232 7.2264 12.3751 11.3490 1.0835 1.0635 1.0384 1.0385 1.0389 1.0370 1.0384 1.1004 1.0892 1.1028 1.1014 1.1031 1.1047 1.1005 1.1040 1.0613 1.1033 1.0884 1.1040 1.0915 1.0994 1.0909 1.0964 1.1071 1.0900 1.0944 1.0924 1.1132 1.0668
irintensity: 28.3679 0.0112 0.0564 0.5347 0.2855 0.6538 0.5188 0.1751 0.2696 0.6070 4.9767 4.2380 1.2379 0.2421 0.0485 2.8023 0.6705 1.6789 3.0717 1.0824 4.0485 8.7300 8.1464 15.0622 1.3170 1.2489 12.4521 6.8557 2.1347 10.5777 0.3605 8.2112 1.6119 8.3020 1.6178 11.2845 29.4029 4.1803 25.9604 13.0904 4.3319 10.9542 4.4509 0.3556 2.9534 1.5397 3.3075 8.9094 1.1880 11.2908 2.2857 15.3959 7.0865 1.3519 2.3025 0.3123 0.7598 5.2944 22.4195 163.3745 4.9804 0.3666 5.8957 10.9887 21.7716 11.6591 4.7091 12.0771 7.6931 0.7874 2.3645 5.9799 4.5338 8.5841 15.0027 12.8728 13.0096 2.8678 1.8730 1.9547 2.0773 23.2328 2.7149 18.0183 2.6549 5.4627 3.1057 6.5207 7.3562 10.1179 0.7072 7.3617 4.6900 7.0680 7.5718 5.8706 7.1277 5.2852 4.9698 5.2200 3.6790 13.5011 2.4073 0.9646 10.3653 1.1777 4.8623 4.1365 2.5491 1.2886 37.0255 59.2595 0.3584 7.1992 6.5950 11.3629 7.8571 1.9909 0.5259 1.5718 89.0039 0.9356 56.4618 51.7246 8.4190 42.3222 133.3441 2.1255 44.0804 8.6196 10.6069 28.4983 130.4908 17.0429 265.9068 6.7751 12.4672 32.9041 30.0547 4.3178 0.5367 9.2361 0.6229 431.9692 783.0787 71.0027 21.6316 32.6859 36.0786 23.1883 15.0834 1.7614 8.1360 28.6801 10.1958 9.8538 27.0305 19.1646 6.6578 11.9928 10.5099 9.3207 4.4283 15.8625 4.0306 8.0245 12.3913 15.3661 11.0264 5.8548 3.9814 7.3867 10.1283 315.1520
temp: 333.150 k
press: 1.00000 atm
elementType: 6 6 6 6 6 6 1 1 1 1 6 6 1 1 1 6 6 6 6 6 1 6 1 1 6 1 1 1 6 8 8 6 1 1 1 46 11 6 1 6 1 1 6 8 8 6 1 8 6 1 1 1 6 1 1 1 6 1 1 1
symmnumber: 1
zpe: 1269293.4 jmol-1
zpe.correction: 0.483448 hartree
zpe.thermalcorrener: 0.523763 hartree
zpe.thermalcorrenthalpy: 0.524818 hartree
zpe.thermalcorrgfe: 0.405925 hartree
zpe.sumelectzpe: -1594.981274 hartree
zpe.sumelectthermal: -1594.940960 hartree
zpe.sumelectthermalent: -1594.939905 hartree
zpe.sumelectthermalfe: -1595.058797 hartree
dipole: -0.2811 1.1384 3.0543
dipole: 3.2716
quadrupole: -193.5664 -196.0703 -188.5766
quadrupole: -3.9139 -2.6730 3.0633
quadrupole: -0.8287 -3.3325 4.1612 -3.9139 -2.6730 3.0633
hfenergy: -1595.4647225 hartree
pointgroup: C01 [X(C24H29Na1O5Pd1)]
dipole: -0.1105866 0.4478636 1.2016361 debye
polarizability: 337.6677639|-30.7558447|310.9203803|-2.7660969|2.8665476|280.2692548 unknown
InChI: InChI=1/C17H16O2.C5H10O.C2H3O2.Na.Pd/c1-12-4-8-14(9-5-12)17(3,16(18)19)15-10-6-13(2)7-11-15;1-3-5(6)4-2;1-2(3)4;;/h4-10H,1-3H3;3,5-6H,1,4H2,2H3;1H3;;/q-1;;-1;+2;/rC24H29NaO5Pd/c1-6-20(26)22-14-31(22)21-13-16(3)9-12-19(21)23(5,18-10-7-15(2)8-11-18)24-25(28-24,30(24)31)27-17(4)29(25)31/h7-13,20,22,26H,6,14H2,1-5H3
charge 0 multiplicity 1
60 atoms
C  2.97184597 2.81220186 -0.09861723
C  1.62483951 2.86633509 -0.45061135
C  1.02233764 1.82515645 -1.1723223
C  1.82246253 0.74899936 -1.5652025
C  3.16891151 0.69181121 -1.2016599
C  3.7670053 1.71262474 -0.45495827
H  3.41292317 3.62742498 0.48215289
H  1.01315972 3.71163429 -0.12004703
H  1.3859827 -0.08001921 -2.12465674
H  3.75390665 -0.18988132 -1.47459745
C  -0.48780457 1.89830595 -1.40677223
C  5.21414515 1.6213339 -0.05030811
H  5.87886335 1.70021634 -0.92475832
H  5.48737374 2.42185776 0.65123613
H  5.42900592 0.65481212 0.43156964
C  -1.20319101 2.04432731 -0.05694281
C  -1.03422016 1.10887118 0.99987145
C  -2.16296532 3.04300018 0.13614742
C  -1.87745516 1.15412298 2.11997518
C  -2.96776312 3.09885598 1.27709865
H  -2.31750602 3.79434216 -0.63935282
C  -2.86504097 2.13192269 2.27997103
H  -1.72658542 0.41733345 2.91768558
H  -3.70154179 3.90361785 1.37594102
C  -0.76054947 3.05909975 -2.37701063
H  -1.82659418 3.12910144 -2.63947768
H  -0.43462243 4.01837973 -1.94863062
H  -0.19758044 2.86678061 -3.29867208
C  -1.01040105 0.62532761 -2.12256557
O  -1.77554803 -0.17399803 -1.46694756
O  -0.68295026 0.41268793 -3.29971538
C  -3.77576033 2.13421828 3.47740788
H  -4.67286797 1.52309579 3.28878743
H  -3.27755658 1.71734927 4.3643629
H  -4.11726014 3.15059898 3.71903875
Pd -0.69193999 -0.77108132 0.26791079
Na -1.2731507 -1.85622829 -2.97143268
C  0.52862997 -1.05111324 1.84970088
H  -0.01266419 -1.34754192 2.7613309
C  0.64380317 0.3816243 1.62919525
H  0.55550569 1.0402274 2.4942218
H  1.45299311 0.68420244 0.95816921
C  -1.39343427 -3.46127071 -0.84075276
O  -1.89601359 -3.81882934 -1.90890455
O  -0.44895329 -2.5651196 -0.8026748
C  1.68823424 -1.98757047 1.51893358
H  1.36721994 -3.01310943 1.80187081
O  2.06191817 -1.95127972 0.16882561
C  2.92497725 -1.63118864 2.34286274
H  1.31496186 -2.31049524 -0.34905459
H  2.64239335 -1.5709132 3.4071744
H  3.23282082 -0.61552824 2.03312993
C  4.06879294 -2.6125914 2.13487629
H  4.9652844 -2.31690939 2.69889968
H  3.78506862 -3.62622859 2.45964837
H  4.32629315 -2.66396134 1.06795815
C  -1.86990544 -4.00569551 0.48368125
H  -2.44001804 -4.93046109 0.34034821
H  -1.01755401 -4.16699213 1.15868689
H  -2.52285155 -3.250784 0.95021827
