program: Gaussian 16
title: MN15/BS1
version: ES64L-G16RevC.01
method: RMN15
basis: GenECP
operation: Freq
keyword: #N
keyword: Geom=AllCheck
keyword: Guess=TCheck
keyword: SCRF=Check
keyword: GenChk
keyword: RMN15/GenECP
keyword: Freq
converged: YES YES YES YES
title: Mulliken charges:
elementType: C C C C C C H H H H C C H H H C C C C C H C H H C H H H C O O C H H H Pd Na C H C H H C O O C H O C H H H C H H H C H H H
charge: -0.023860 0.021010 0.021668 -0.000044 -0.006278 -0.059234 -0.022805 -0.001645 -0.023827 -0.036018 -0.224318 0.087656 0.018607 0.015027 0.040240 0.083809 -0.112837 -0.020411 0.010540 -0.007025 -0.036605 -0.029164 -0.029424 -0.036494 0.178335 0.016866 0.004474 0.035904 0.202152 -0.334469 -0.300711 0.087724 0.015741 0.016899 0.042230 -0.189300 0.553196 -0.015355 0.009298 0.193775 0.062553 0.000807 0.127982 -0.310531 -0.366210 0.157776 0.010072 -0.253760 0.015383 0.167158 -0.004090 -0.016742 0.052030 0.009592 0.014547 0.012339 0.053519 0.029218 0.028139 0.064890
chargesum: -0.00000
title: Mulliken charges with hydrogens summed into heavy atoms:
elementType: C C C C C C C C C C C C C C C C O O C Pd Na C C C O O C O C C C
charge: -0.046665 0.019365 0.021668 -0.023871 -0.042297 -0.059234 -0.224318 0.161531 0.083809 -0.112837 -0.057016 -0.018884 -0.043518 -0.029164 0.235579 0.202152 -0.334469 -0.300711 0.162593 -0.189300 0.553196 -0.006057 0.257135 0.127982 -0.310531 -0.366210 0.167847 -0.086602 -0.005449 0.088508 0.175766
chargesum: 0.00000
1716.lowfreq: -306.4907 -6.2718 -2.2091 -0.0004 0.0008 0.0010 4.3919 20.4475 33.1765
frequency: -306.4907 20.3455 33.1757 36.9810 37.1591 45.1981 46.8184 48.7788 57.5181 76.5028 85.2772 92.2484 95.9663 99.6928 112.7856 120.7381 130.1882 132.0174 146.9090 149.5098 166.8143 180.2038 185.9787 198.5704 211.9401 227.0790 230.6654 243.9891 248.2046 264.4974 274.3058 277.7862 287.5859 311.6834 322.1766 325.3186 338.9996 348.0959 352.9231 359.9623 369.7593 393.5111 402.6588 412.1900 422.2623 437.2290 450.5951 466.5897 484.4387 493.0213 525.6174 566.9122 572.6211 610.1898 612.9014 619.5361 635.8745 653.9649 663.0201 681.4576 731.9622 740.5181 770.0009 774.6249 780.5264 817.2608 827.8510 839.3539 849.2390 856.3085 869.5792 877.8842 888.6619 904.5779 920.3492 923.2135 961.1211 967.2214 982.3206 986.7448 986.8715 995.4784 998.9877 1000.2392 1015.4872 1018.2552 1019.6934 1041.1022 1041.1600 1042.1788 1072.1728 1075.6967 1080.7588 1088.0716 1096.0704 1116.4461 1127.0091 1133.9959 1159.7366 1166.5002 1182.6111 1187.3177 1223.7851 1226.7153 1240.4128 1252.6112 1264.5231 1267.2397 1281.3670 1301.5617 1304.6965 1325.7762 1341.0069 1351.6277 1357.3223 1358.6143 1369.2919 1378.6140 1379.2327 1383.4247 1396.2446 1405.6284 1406.5704 1420.7868 1424.7445 1428.3323 1432.1943 1434.6065 1436.6759 1436.7376 1441.7769 1444.0439 1451.4383 1454.8952 1457.9834 1460.5279 1463.9639 1515.9550 1552.6629 1626.4962 1650.6302 1680.7306 1698.1833 1726.3596 1753.9877 3041.3993 3073.5588 3074.6307 3075.3263 3078.5456 3078.9522 3099.6734 3114.7899 3134.0482 3157.4377 3159.3970 3168.5147 3169.3945 3171.2695 3171.7353 3183.0561 3183.0888 3183.8265 3186.3035 3201.5868 3204.5527 3210.7218 3217.5254 3217.8300 3220.9988 3251.7254 3257.0741 3266.8090 3813.4787
redmass: 7.4744 4.6946 1.0202 3.9937 3.8322 1.1948 4.9883 2.9755 4.9577 3.1853 3.4668 2.9137 5.4919 4.5344 3.2815 1.2503 7.3678 3.8957 6.0448 5.6368 5.2812 11.2468 4.6666 6.2290 2.5204 2.6383 3.3974 3.5390 2.7404 6.3656 4.5927 3.1693 3.8019 3.6114 3.0173 3.3095 3.4643 1.9846 2.7323 1.9876 2.2736 3.5361 3.4864 4.7477 2.8593 5.8734 3.1761 3.7276 2.4419 3.9750 3.8076 3.2897 3.5367 3.4770 2.9925 2.3636 6.7331 2.8175 6.2547 5.9261 3.6120 2.8164 3.3621 1.4637 3.0700 5.6246 1.8542 2.2339 1.6401 2.2763 1.2647 1.9557 2.1810 1.4346 2.1638 1.4889 1.8738 5.6170 1.3850 1.4184 1.3815 1.5271 1.4011 1.4807 1.5156 2.3071 3.0612 1.6254 1.6194 2.0306 1.6215 2.0850 1.9516 1.8559 1.4000 1.6238 1.2771 1.7001 1.4043 1.8574 1.2098 1.5641 1.5150 1.6329 2.1053 4.6796 2.4726 1.3990 1.8371 1.4349 1.3072 1.3639 3.1120 1.7209 1.5249 3.4791 1.5855 1.3673 1.3768 1.5216 1.3442 1.0737 2.2517 1.1658 1.9236 2.4034 1.1103 1.1023 1.0564 1.0673 1.0434 1.2395 1.2949 1.4757 1.5806 1.1845 4.7645 3.9514 3.2389 6.5927 7.2196 7.4157 7.1550 12.2349 11.2585 1.0682 1.0389 1.0388 1.0366 1.0377 1.0383 1.0859 1.0973 1.0877 1.1014 1.1015 1.0600 1.1025 1.1007 1.1050 1.1048 1.0942 1.1014 1.1042 1.1030 1.0881 1.0914 1.1069 1.0909 1.0965 1.0925 1.1123 1.0927 1.0662
irintensity: 29.4955 0.4942 0.4882 0.0397 0.2262 0.2296 1.4396 0.2016 0.2173 2.9039 4.1433 0.7916 4.9174 0.7948 0.4477 0.6572 0.8503 0.8066 0.6458 1.7533 2.9422 4.6414 6.7537 16.9353 2.5614 2.6605 13.1064 7.9182 10.4564 13.9823 7.9387 25.3051 13.4911 9.3384 9.8770 1.2700 62.3414 60.5112 35.0247 16.3416 1.6716 6.5459 10.2492 4.6671 0.1874 4.1024 0.4789 4.8732 23.8862 1.2615 9.5049 4.4165 17.4056 13.4858 5.5953 11.2130 0.3390 8.2452 1.3259 20.9026 3.7897 2.7996 4.6018 2.9796 20.3086 13.1209 3.8043 6.3023 13.8476 9.7743 0.1983 6.9590 4.7265 9.5853 14.0036 10.3961 3.8747 7.7919 0.7042 1.5139 2.7533 17.5523 3.9059 10.6637 4.7342 3.5683 2.6102 2.8213 20.4033 8.8348 14.6374 2.7058 1.5975 4.7865 21.9213 4.7783 9.5141 9.3346 4.2007 31.2120 2.0729 24.5262 2.8617 1.1906 0.6732 0.6062 9.5396 5.8654 5.8999 5.5139 3.2790 33.9811 1.0613 0.3241 3.6298 5.0972 11.6545 1.4676 0.2274 7.1708 14.3574 53.1797 1.7588 72.8062 41.6375 131.3481 9.7348 15.9096 6.7114 18.4810 3.6892 18.6640 30.9699 3.6409 45.1046 35.4930 388.4374 29.0847 38.7693 4.4306 0.7849 11.6621 0.6117 400.9130 821.5882 21.6300 27.2066 25.8345 14.7284 31.6465 2.4316 12.3169 23.9241 21.8168 8.7015 9.8578 3.8408 22.9542 8.1536 18.5098 9.6048 3.7983 13.2478 17.3427 3.9452 8.5866 8.4663 13.9607 11.9327 10.6884 7.2538 4.5051 0.7709 87.8646
temp: 333.150 k
press: 1.00000 atm
elementType: 6 6 6 6 6 6 1 1 1 1 6 6 1 1 1 6 6 6 6 6 1 6 1 1 6 1 1 1 6 8 8 6 1 1 1 46 11 6 1 6 1 1 6 8 8 6 1 8 6 1 1 1 6 1 1 1 6 1 1 1
symmnumber: 1
zpe: 1267391.6 jmol-1
zpe.correction: 0.482724 hartree
zpe.thermalcorrener: 0.523400 hartree
zpe.thermalcorrenthalpy: 0.524455 hartree
zpe.thermalcorrgfe: 0.404510 hartree
zpe.sumelectzpe: -1594.973111 hartree
zpe.sumelectthermal: -1594.932435 hartree
zpe.sumelectthermalent: -1594.931380 hartree
zpe.sumelectthermalfe: -1595.051325 hartree
dipole: 2.3205 -2.1725 -3.8664
dipole: 5.0053
quadrupole: -192.7279 -195.5708 -188.9069
quadrupole: 6.7260 3.8080 1.1087
quadrupole: -0.3260 -3.1690 3.4950 6.7260 3.8080 1.1087
hfenergy: -1595.4558353 hartree
pointgroup: C01 [X(C24H29Na1O5Pd1)]
dipole: 0.9129645 -0.854734 -1.5211409 debye
polarizability: 322.4325302|28.3769417|329.9695682|4.6287174|5.3433104|280.1783221 unknown
InChI: InChI=1/C17H16O2.C5H10O.C2H3O2.Na.Pd/c1-12-4-8-14(9-5-12)17(3,16(18)19)15-10-6-13(2)7-11-15;1-3-5(6)4-2;1-2(3)4;;/h4-10H,1-3H3;3,5-6H,1,4H2,2H3;1H3;;/q-1;;-1;+2;/rC24H29NaO5Pd/c1-6-19(26)21-14-31(21)20-13-16(3)9-12-18(20)22(4,17-10-7-15(2)8-11-17)24-25(28-24,30(24)31)23(5,27-25)29(25)31/h7-13,19,21,26H,6,14H2,1-5H3
charge 0 multiplicity 1
60 atoms
C  3.54209372 0.14523772 1.15506464
C  2.24959615 -0.2441526 1.52865528
C  1.70017406 -1.434251 1.04607422
C  2.49649909 -2.23458586 0.20962624
C  3.77896023 -1.84279212 -0.16246461
C  4.32804144 -0.63634416 0.30065005
H  3.94245139 1.08961925 1.53649462
H  1.66404237 0.39786463 2.18661916
H  2.08151501 -3.16788867 -0.18389201
H  4.36692819 -2.47967704 -0.82964357
C  0.28339795 -1.92291643 1.35734047
C  5.72452634 -0.22269347 -0.07819042
H  5.95382547 -0.48683795 -1.12075243
H  5.87042496 0.85964094 0.044662
H  6.46957412 -0.72916339 0.5561308
C  -0.43288689 -2.29262854 0.05334808
C  -0.64921801 -1.34867223 -0.98517504
C  -1.02333338 -3.55077858 -0.10661311
C  -1.49575839 -1.66723706 -2.05797837
C  -1.83343858 -3.86531002 -1.20018352
H  -0.87605615 -4.31298915 0.65956581
C  -2.11422854 -2.91509659 -2.18506791
H  -1.64919155 -0.91714896 -2.84285162
H  -2.26781605 -4.86603324 -1.27511887
C  0.42063223 -3.10286827 2.33619725
H  -0.56144607 -3.48765055 2.64896244
H  1.00094426 -3.92262903 1.88664974
H  0.94473765 -2.73973049 3.22912266
C  -0.55912589 -0.86393333 2.12083657
O  -1.6308959 -0.42483575 1.56529552
O  -0.1913665 -0.49728935 3.24799648
C  -3.04567659 -3.21294263 -3.32824467
H  -2.7788149 -2.63858731 -4.22683309
H  -3.03549547 -4.28151926 -3.58548099
H  -4.08282845 -2.94863714 -3.06702841
Pd -0.9399397 0.52987047 -0.22020579
Na -1.57361637 1.42522982 2.99095143
C  0.06078358 1.25551407 -1.79767382
H  -0.57161661 1.427762 -2.68115354
C  0.62577269 -0.0814208 -1.67656796
H  0.68683728 -0.6850094 -2.58305048
H  1.53616259 -0.1741417 -1.0745902
C  -2.66913619 2.63396888 0.92393543
O  -3.1597042 2.82393181 2.04351028
O  -1.4326158 2.27652403 0.77571946
C  0.86001385 2.48364734 -1.39145079
H  0.1381537 3.29623194 -1.2027828
O  1.54536893 2.3043064 -0.17692491
C  1.82269499 2.90932978 -2.50456789
H  2.20531813 1.59827749 -0.27354409
H  1.2616507 3.00527163 -3.44909537
H  2.54096325 2.08079758 -2.65775934
C  2.55696853 4.20155919 -2.17771657
H  1.8493169 5.03952014 -2.08303057
H  3.0819592 4.10649412 -1.21697012
H  3.29050617 4.46277652 -2.95373004
C  -3.50105585 2.77357954 -0.33036685
H  -4.402993 3.36480094 -0.13433277
H  -2.90364925 3.22021321 -1.13762962
H  -3.80111281 1.76467564 -0.65645449
