program: Gaussian 09
title: 000075737
version: EM64L-G09RevD.01
frameworkgroup: C1[X(C10H13NO2)]
method: RPBEPBE
basis: SDD
operation: Freq
keyword: #p
keyword: freq=noraman
keyword: PBEPBE/SDD
title: #p freq=noraman PBEPBE/SDD
converged: YES YES NO NO
title: Mulliken charges:
elementType: O O N C C C C C C C C C C H H H H H H H H H H H H H
charge: -0.267396 -0.244090 -0.648068 -0.554667 -0.152182 0.472936 0.214306 -0.414550 -0.397464 -0.228153 -0.233392 -0.242605 -0.499204 0.232019 0.220955 0.244235 0.233355 0.257377 0.316549 0.294372 0.223002 0.224325 0.226643 0.234256 0.242818 0.244622
chargesum: 0.00000
title: Mulliken charges with hydrogens summed into heavy atoms:
elementType: O O N C C C C C C C C C C
charge: -0.267396 -0.244090 -0.037148 -0.101694 0.092053 0.472936 0.214306 -0.181194 -0.140087 -0.005151 -0.009068 -0.015961 0.222493
polarizability: 1.63539396e+02 3.69959923e+00 1.15999090e+02 -9.24752202e+00 1.12883670e+01 7.49447194e+01
1716.lowfreq: -18.5220 -5.6016 -0.0009 -0.0008 -0.0007 3.0043 27.4468 45.5871 62.4025
frequency: 27.0110 45.5721 62.3714 72.4174 101.9690 125.3420 177.2371 213.5064 247.9480 264.3681 320.5367 340.7890 402.2564 404.8426 448.9230 477.5998 502.9583 562.4779 615.8337 619.5577 701.4521 706.9551 758.3334 802.3532 842.0223 854.3754 883.6384 922.1543 947.0730 975.4654 989.2692 989.4526 994.3735 1026.5989 1079.8404 1109.5284 1113.2616 1148.8838 1160.9615 1169.1406 1172.8456 1185.9536 1197.7896 1217.8048 1272.9757 1303.3737 1327.8018 1359.5211 1382.3472 1423.8617 1440.2286 1452.8739 1462.7335 1464.3007 1482.4848 1589.3729 1591.8979 1612.5136 1645.9574 2888.5237 3006.5003 3010.7795 3079.5112 3109.1678 3112.2852 3123.1463 3135.8373 3147.2912 3151.7501 3162.1887 3508.3016 3655.4799
redmass: 4.1507 4.2788 3.9945 4.0483 1.1192 3.8013 4.1324 1.3076 4.2136 2.7061 2.8738 4.7675 3.3113 2.7839 1.5634 2.8396 2.3790 4.9010 4.5692 4.4330 3.9958 2.0243 1.9201 4.6900 3.1622 1.2526 2.5352 1.5090 4.9790 1.3923 2.2719 5.9089 1.4413 2.1837 1.6512 1.9472 1.2740 1.5262 1.8891 1.3365 1.2781 1.1139 1.5837 2.5820 1.4493 1.2789 1.2605 1.6817 7.1946 1.1957 2.1711 1.0500 1.1048 1.0597 2.3098 2.1499 2.6969 6.1408 2.9606 1.0806 1.0295 1.0589 1.1040 1.1047 1.0870 1.0861 1.0919 1.0957 1.1050 1.1014 1.0456 1.1001
irintensity: 1.3255 0.9713 0.0995 0.3557 0.2314 2.3452 5.5751 49.7699 3.5988 18.0862 4.4282 12.0652 18.9496 1.1877 98.1645 20.2971 133.0788 6.8408 6.7636 9.6944 3.0400 51.3992 36.1902 5.3756 8.6195 0.1480 7.0159 0.9007 8.1313 0.0208 3.3906 0.1692 1.0804 7.7721 7.6980 99.5953 2.8731 45.6632 119.6319 58.5074 41.6297 0.1924 32.1437 4.1173 20.2125 5.8387 1.7262 3.4659 0.1259 20.8045 7.5164 13.9737 6.0537 16.2326 19.0708 137.8364 78.1515 12.0011 81.7562 40.3906 36.4838 19.4028 12.6887 25.1728 8.9279 0.0189 22.9574 37.2472 14.4007 20.8141 16.6284 17.8361
temp: 298.150 k
press: 1.00000 atm
elementType: 8 8 7 6 6 6 6 6 6 6 6 6 6 1 1 1 1 1 1 1 1 1 1 1 1 1
symmnumber: 1
zpe: 555582.0 jmol-1
zpe.correction: 0.211610 hartree
zpe.thermalcorrener: 0.225033 hartree
zpe.thermalcorrenthalpy: 0.225977 hartree
zpe.thermalcorrgfe: 0.170058 hartree
zpe.sumelectzpe: -593.080655 hartree
zpe.sumelectthermal: -593.067232 hartree
zpe.sumelectthermalent: -593.066287 hartree
zpe.sumelectthermalfe: -593.122207 hartree
dipole: -0.3681 -1.6244 -0.7538
dipole: 1.8282
quadrupole: -68.2627 -74.9991 -76.9104
quadrupole: 10.1269 -3.3225 0.5498
quadrupole: 5.1280 -1.6084 -3.5196 10.1269 -3.3225 0.5498
hfenergy: -593.2922646 hartree
pointgroup: C01 [X(C10H13N1O2)]
dipole: -0.1278288 -0.6642209 -0.2445909 debye
dipolederiv: -0.9110732 -0.3419515 0.1405959 -0.5791389 -1.0407597 0.2343797 0.208005 0.2036092 -0.3425812 -0.8435086 0.3252752 -0.0466099 0.0659927 -0.828485 0.1434336 0.1228246 0.0748725 -0.324818 -0.4291475 -0.1232383 -0.1139776 0.043085 -0.7022369 0.006648 -0.2076837 -0.0107472 -0.6777318 -0.0663837 0.0682986 -0.0295586 -0.0252159 0.0663718 0.0420231 -0.0374843 0.0915172 0.0431951 -0.3106817 0.0305804 0.0813812 0.0381902 0.5575239 -0.0435987 0.2409092 -0.1113762 0.3850791 0.4116202 -0.0514612 -0.0402153 0.0548147 -0.0500635 0.0146003 -0.124734 0.0305536 -0.0778606 1.3468774 -0.1170217 -0.0646456 0.3439662 1.4214167 -0.3297533 -0.3996313 -0.2530778 0.251988 -0.1577037 0.074176 -0.0127658 0.1055246 0.0152394 0.0530717 0.0271287 0.0482514 -0.1421183 -0.1554123 -0.0402058 -0.0347153 -0.1202331 0.0191399 0.0739167 -0.0287207 0.0639424 -0.117124 -0.0006726 -0.0427191 -0.0446663 -0.0524326 0.0602553 0.0938639 -0.0529604 0.0882583 -0.1007876 0.0149063 0.079197 -0.0119255 0.0961971 0.0634567 0.0753925 0.0050906 0.0650666 -0.1174766 0.0418122 0.0187349 -0.0649489 0.0067829 -0.0941737 0.0217713 -0.0488428 0.0296082 -0.1499308 0.5957259 0.2139816 -0.075657 0.1614174 0.3072377 -0.0212031 -0.0754768 -0.0395096 0.2887032 0.0517705 -0.0135205 0.0123321 -0.0667424 -0.0984578 0.0621844 0.0256378 0.0139569 0.0644355 0.0158528 0.0144186 0.0198236 0.0444905 0.0220957 -0.1124096 0.0358693 -0.054697 -0.0550703 0.0434245 0.015644 0.0285197 -0.0384679 -0.1222705 -0.0913273 0.0039546 -0.0853879 -0.0725596 0.0248291 -0.1164608 -0.0061698 -0.1045212 -0.0324612 -0.0477418 -0.0021123 -0.03892 0.1246995 0.0683109 0.0651855 0.0624775 0.0622515 -0.0057078 -0.0705901 0.0516054 -0.068461 0.1005132 0.2046916 0.0983657 -0.0329327 0.0073472 0.2397771 0.0539318 -0.0665622 0.1000471 0.2785002 0.1666753 -0.0153315 0.1139635 -0.0132539 0.1797856 0.0254287 0.2016296 0.0167796 0.2571648 0.0297638 0.0691745 0.053498 0.0838967 -0.0480681 -0.0966314 0.0670312 -0.0963761 0.1046738 0.0054782 -0.0971467 -0.0107344 -0.1194063 -0.0501782 -0.0592114 -0.0078697 -0.0603435 0.132179 -0.1345335 -0.0093643 0.0638622 -0.0100893 0.0960997 -0.0231258 0.0656845 -0.0226268 0.1368289 0.0687095 0.0004091 0.006242 -0.0608025 -0.1031313 0.0573762 0.0223743 0.0519324 0.1051744 -0.0625723 -0.0561542 -0.0400073 0.031919 0.0919676 0.0525768 -0.0967913 0.0228691 -0.060617 -0.018759 -0.0488655 0.0468344 0.0444285 0.0356267 -0.1150062 0.0711247 -0.0597415 -0.0344586 unknown
polarizability: 163.1761856|4.3306243|117.7168799|-10.4295246|7.635347|73.5901394 unknown
InChI: InChI=1S/C10H13NO2/c1-13-10(12)9(11)7-8-5-3-2-4-6-8/h2-6,9H,7,11H2,1H3
charge 0 multiplicity 1
26 atoms
O  -2.930254 -1.090475 0.111839
O  -3.429619 1.144165 -0.300511
N  -0.797178 1.75679 -0.761696
C  -0.241314 -0.220239 0.695565
C  -1.089147 0.351128 -0.499761
C  1.244167 -0.191386 0.380878
C  -2.589275 0.217473 -0.221885
C  1.876262 -1.309217 -0.225349
C  2.024681 0.964342 0.648347
C  3.249839 -1.275754 -0.55615
C  3.398888 1.001426 0.318948
C  4.01679 -0.118408 -0.285235
C  -4.370962 -1.331632 0.373674
H  -0.578119 -1.25294 0.895583
H  -0.465761 0.401581 1.580643
H  -0.88684 -0.313098 -1.374602
H  1.289265 -2.214156 -0.428822
H  1.543456 1.83194 1.113389
H  -1.611139 2.342919 -0.956362
H  0.043015 1.95146 -1.303084
H  3.722391 -2.150488 -1.017784
H  3.987692 1.900032 0.536889
H  5.083158 -0.092054 -0.536709
H  -4.43396 -2.399084 0.626059
H  -4.965251 -1.097774 -0.525542
H  -4.716682 -0.701651 1.21008
