program: Gaussian 16
title: (SMD= 2-propanol)-MN15/BS1
version: ES64L-G16RevC.01
frameworkgroup: C1[X(C2H4O2)]
method: RMN15
basis: def2SVP
operation: Freq
keyword: #NGeom=AllCheck
keyword: Guess=TCheck
keyword: SCRF=Check
keyword: GenChk
keyword: RMN15/def2SVP
keyword: Freq
title: (SMD = 2-propanol)-MN15/BS1
converged: YES YES YES YES
title: Mulliken charges:
elementType: C O C H H H O H
charge: 0.070287 -0.288702 0.007205 0.070825 0.070806 0.047564 -0.209436 0.231451
chargesum: -0.00000
title: Mulliken charges with hydrogens summed into heavy atoms:
elementType: C O C O
charge: 0.070287 -0.288702 0.196400 0.022015
1716.lowfreq: -0.0013 -0.0011 -0.0007 20.4858 29.9747 33.2808 83.3609 427.9829 549.0159
frequency: 83.3158 427.9715 549.0123 591.0312 660.4031 902.0338 988.6422 1039.9159 1190.0472 1315.5963 1398.3626 1409.8070 1425.8959 1855.2462 3098.6079 3193.3226 3238.2833 3774.2858
redmass: 1.0890 2.7605 1.4290 3.9143 1.5241 2.8566 1.5816 1.9656 1.7144 1.3741 1.0654 1.0434 3.3753 10.7646 1.0379 1.1028 1.1080 1.0648
irintensity: 2.1176 5.1110 46.6384 85.3189 139.9687 7.6647 40.3534 25.3106 265.7967 36.2423 26.3231 16.5440 266.4082 578.2270 0.0399 0.4809 3.3590 185.9840
temp: 333.150 k
press: 1.00000 atm
elementType: 6 8 6 1 1 1 8 1
symmnumber: 1
zpe: 162343.9 jmol-1
zpe.correction: 0.061834 hartree
zpe.thermalcorrener: 0.067211 hartree
zpe.thermalcorrenthalpy: 0.068266 hartree
zpe.thermalcorrgfe: 0.030897 hartree
zpe.sumelectzpe: -228.592721 hartree
zpe.sumelectthermal: -228.587344 hartree
zpe.sumelectthermalent: -228.586289 hartree
zpe.sumelectthermalfe: -228.623658 hartree
dipole: -0.6136 -2.1649 0.0002
dipole: 2.2501
quadrupole: -17.9400 -28.3709 -22.5847
quadrupole: -2.6052 -0.0003 0.0004
quadrupole: 5.0252 -5.4057 0.3805 -2.6052 -0.0003 0.0004
hfenergy: -228.6545548 hartree
pointgroup: C01 [X(C2H4O2)]
dipole: -0.2428821 -0.8513064 0.0000784 debye
dipolederiv: 1.8455431 -0.0371071 -0.0000384 -0.1385537 2.3363304 0.0000731 -0.0000818 0.0000996 0.3903391 -1.0136681 -0.4410126 0.0000014 -0.1464173 -1.4375829 -0.0000481 0.0000767 0.000158 -0.4506782 -0.4218883 -0.119651 0.0000061 -0.1560174 -0.079335 -0.0000344 -0.0001206 -0.0000571 -0.0642764 0.0735704 0.000621 0.0015365 0.0030395 0.0870466 -0.0867552 -0.0325855 -0.0766629 0.0332955 0.0735921 0.0005998 -0.0015067 0.0029944 0.0870569 0.0867647 0.0326147 0.0766684 0.0332476 0.0477149 0.0236593 -0.0000036 0.0787921 -0.0325254 0.0000123 -0.0000287 0.0000053 0.1124286 -1.0293962 0.6506034 0.0000177 0.4518498 -1.3084738 -0.0000219 0.0001151 -0.000207 -0.4714152 0.4245322 -0.0777129 -0.000013 -0.0956875 0.3474832 0.0000095 0.0000101 -0.0000043 0.417059 unknown
polarizability: 36.7506748|1.3368629|37.5867039|-0.001274|-0.0007415|24.2651424 unknown
InChI: InChI=1/C2H4O2/c1-2(3)4/h3H,1H3
charge 0 multiplicity 1
8 atoms
C  0.08763709 0.1195344 0.00016095
O  0.63217581 1.20344649 -0.0000617
C  -1.39048136 -0.11044793 -0.00001282
H  -1.66899728 -0.69937369 -0.88596409
H  -1.66919218 -0.69923929 0.88596564
H  -1.92105405 0.84761553 -0.0001448
O  0.77836906 -1.02454863 -0.00004445
H  1.7325479 -0.81575888 -0.00015973
