program: Gaussian 16
title: (SMD = 2-propanol)-MN15/BS1
version: ES64L-G16RevC.01
method: RMN15
basis: def2SVP
operation: Freq
keyword: #N
keyword: Geom=AllCheck
keyword: Guess=TCheck
keyword: SCRF=Check
keyword: GenChk
keyword: RMN15/def2SVP
keyword: Freq
converged: YES YES YES YES
title: Mulliken charges:
elementType: C C H H H C C H H H H H H O C O N H C H C H H C C C C H C H C H H C O O O H Na
charge: 0.093039 -0.173523 0.013143 0.022769 0.012171 0.079137 0.068911 0.023432 0.020890 0.019321 0.020782 0.020848 0.025568 -0.304243 0.205900 -0.313296 -0.139812 0.152073 0.010875 0.026595 0.167797 0.006304 -0.003399 -0.041305 -0.012561 -0.037480 -0.049752 -0.012283 -0.052361 -0.006876 0.129487 -0.008236 -0.007528 0.150822 -0.418394 -0.432088 -0.229983 0.224716 0.748541
chargesum: -0.00000
title: Mulliken charges with hydrogens summed into heavy atoms:
elementType: C C C C O C O N C C C C C C C C C O O O Na
charge: 0.141122 -0.173523 0.142780 0.136109 -0.304243 0.205900 -0.313296 0.012260 0.037470 0.170702 -0.041305 -0.024844 -0.044356 -0.057988 -0.059888 0.129487 0.150822 -0.418394 -0.432088 -0.005267 0.748541
chargesum: 0.00000
1716.lowfreq: -12.9672 -4.8294 -0.0008 -0.0006 -0.0005 12.7337 22.3753 25.9458 40.2980
frequency: 19.9051 25.7368 40.1553 48.0323 54.7766 57.5055 79.9310 92.5634 104.8231 126.8606 135.7160 182.7994 184.8678 205.2659 218.8066 244.8256 253.5357 283.4638 297.4986 317.4061 320.5343 344.6985 357.9278 365.3468 375.0598 416.4904 417.1209 430.1819 439.9110 454.3982 457.7504 483.8431 499.4542 557.3655 573.4811 635.4637 689.5916 734.3914 742.7150 775.2232 781.5972 784.7242 825.0716 843.9143 857.4108 877.1236 892.2420 915.0958 920.2462 922.8804 935.2157 977.6280 999.8666 1003.0279 1009.3369 1017.9298 1021.9539 1026.3907 1095.8864 1103.0815 1150.5672 1162.7609 1166.3957 1189.4159 1197.0493 1219.9746 1237.9256 1257.4286 1263.2387 1268.7329 1307.5279 1321.4565 1339.1900 1353.1999 1361.7725 1367.1159 1372.8945 1380.5507 1402.4746 1417.2996 1422.2648 1423.1588 1427.3074 1432.8219 1449.3328 1468.8177 1494.7870 1541.3723 1562.3208 1667.6923 1690.9838 1702.2930 1794.1482 3075.7972 3077.4269 3082.0727 3082.7725 3117.8206 3161.3259 3171.7172 3172.9557 3175.7298 3186.1535 3198.1471 3208.4410 3209.6248 3215.3613 3224.4118 3237.4302 3629.8882 3836.8927
redmass: 5.2880 5.8803 4.6309 6.8961 6.1061 7.7171 4.7870 4.4601 4.0196 6.0496 4.0281 4.6993 7.6554 1.4617 4.6218 5.0785 1.0600 1.0730 3.2944 4.1338 3.0999 2.6758 4.6778 1.8965 1.7675 2.9875 2.8486 3.0029 3.0077 2.9440 3.0409 1.5038 3.1777 2.6007 3.7533 6.5437 4.2625 6.1206 3.7581 5.5486 8.0127 3.9601 5.3965 1.2581 1.9994 4.2946 2.1681 2.5250 1.4937 1.5429 1.2076 1.4899 1.5042 2.5080 2.3160 1.4243 1.8124 1.6559 1.3978 3.1946 1.0876 1.3890 1.3476 2.1519 1.5448 1.6324 2.0949 2.0752 1.9271 1.9076 1.4335 2.4032 2.1377 2.0376 1.5829 1.4953 1.3835 4.9648 1.0470 1.0473 1.0604 1.1705 1.1539 1.1118 1.0818 3.4289 9.6666 4.1608 3.7844 7.1536 12.1581 7.4081 11.8715 1.0369 1.0378 1.0392 1.0649 1.0847 1.1030 1.1044 1.1044 1.1054 1.1049 1.1043 1.1033 1.0887 1.0901 1.0973 1.0961 1.0780 1.0664
irintensity: 5.7714 16.4652 2.9635 11.9926 2.6563 3.6694 0.8728 5.9733 2.2090 22.8344 9.3283 8.3841 2.8486 8.0881 14.7971 39.1380 0.1863 0.7401 25.9046 12.8175 22.1626 3.7802 20.9318 72.5326 116.2103 8.2869 11.2775 1.9120 11.3005 7.7471 7.6953 133.4546 11.8658 32.6256 12.9961 1.0442 48.5727 2.5426 2.0707 1.8025 50.5091 21.1444 61.8979 0.6891 51.2683 3.2941 7.8856 35.2682 2.6265 2.3164 0.3892 2.5838 0.7920 3.5369 2.0754 0.3795 3.4737 1.3364 15.6780 134.0172 5.4637 130.3044 112.3878 368.4968 69.2989 3.3812 54.2413 19.6163 131.8981 12.1497 88.4892 50.3249 96.3929 104.6232 53.4428 62.9613 22.0546 21.3061 0.5445 0.4611 1.5917 15.8422 16.5568 0.7396 2.2402 28.6502 879.0356 626.9342 290.9465 18.1253 877.9412 93.2217 621.1700 18.7323 28.8556 15.1089 44.9753 12.0948 25.3400 17.7436 28.8314 39.4108 35.7081 11.5260 13.1981 17.9170 14.5730 10.3459 8.7734 182.3358 244.9644
temp: 333.150 k
press: 1.00000 atm
elementType: 6 6 1 1 1 6 6 1 1 1 1 1 1 8 6 8 7 1 6 1 6 1 1 6 6 6 6 1 6 1 6 1 1 6 8 8 8 1 11
symmnumber: 1
zpe: 811871.3 jmol-1
zpe.correction: 0.309225 hartree
zpe.thermalcorrener: 0.336155 hartree
zpe.thermalcorrenthalpy: 0.337210 hartree
zpe.thermalcorrgfe: 0.246647 hartree
zpe.sumelectzpe: -1135.278028 hartree
zpe.sumelectthermal: -1135.251098 hartree
zpe.sumelectthermalent: -1135.250043 hartree
zpe.sumelectthermalfe: -1135.340607 hartree
dipole: 8.2000 -3.3003 1.8649
dipole: 9.0338
quadrupole: -37.9730 -113.0631 -120.1312
quadrupole: -23.5388 15.5382 -9.3025
quadrupole: 52.4161 -22.6740 -29.7421 -23.5388 15.5382 -9.3025
hfenergy: -1135.5872537 hartree
pointgroup: C01 [X(C14H18N1Na1O5)]
dipole: 3.2261203 -1.2984355 0.7337261 debye
polarizability: 278.5677212|-13.5340141|201.6207926|-0.3588514|-35.1520994|220.8572858 unknown
InChI: InChI=1/C14H18NO5.Na/c1-14(2,3)20-13(19)15-11(12(17)18)8-9-4-6-10(16)7-5-9;/h4-7,11,15-16H,8H2,1-3H3;/q-2;+2/rC14H18NNaO5/c1-13(2,3)19-12(18)15-11(14-16(20-14)21-14)8-9-4-6-10(17)7-5-9/h4-7,11,15,17H,8H2,1-3H3
charge 0 multiplicity 1
39 atoms
C  -2.95235342 -1.08899322 0.10620636
C  -2.0474807 -2.31469064 0.07412505
H  -2.66427288 -0.35613345 -0.65900226
H  -3.99326487 -1.39750319 -0.07373286
H  -2.90182899 -0.60869823 1.09568834
C  -2.05002678 -3.0022858 -1.28595288
C  -2.45560313 -3.29971943 1.16038151
H  -3.04847406 -3.42182095 -1.48060794
H  -1.79939969 -2.30173117 -2.09203393
H  -1.32327467 -3.82946169 -1.29266503
H  -1.78524586 -4.1724969 1.15952108
H  -2.40699017 -2.82140554 2.15019966
H  -3.48457789 -3.64748447 0.98890081
O  -0.6950988 -1.94582477 0.45363829
C  0.03882344 -1.0855034 -0.27038336
O  -0.33379492 -0.54529308 -1.30324982
N  1.25565794 -0.90792032 0.29518604
H  1.52783566 -1.48374187 1.08997195
C  2.24760487 -0.00879774 -0.23743108
H  2.0957747 0.07644623 -1.32575137
C  2.16265511 1.40736384 0.37713794
H  2.90994651 2.03348548 -0.13168255
H  2.44828881 1.33548502 1.43991381
C  0.78346428 1.99142232 0.24814262
C  -0.18407986 1.77438819 1.23979503
C  0.38823542 2.6582946 -0.91836241
C  -1.50374161 2.19137253 1.07109637
H  0.10034592 1.25559128 2.16026168
C  -0.92796914 3.08032153 -1.10237688
H  1.12254822 2.83723754 -1.70999488
C  -1.88669056 2.83917523 -0.10990405
H  -2.25580372 2.02056305 1.84529339
H  -1.22716336 3.59612991 -2.01987582
C  3.65239363 -0.56341768 0.0031026
O  3.778206 -1.60252146 0.70436003
O  4.61207327 0.08809728 -0.48759483
O  -3.18192247 3.21451526 -0.24282977
H  -3.32481893 3.64616204 -1.10084307
Na 6.03953283 -1.42550203 0.43898786
