program: Gaussian 16
title: (SMD = 2-propanol)-MN15/BS1
version: ES64L-G16RevC.01
method: RMN15
basis: def2SVP
operation: Freq
keyword: #N
keyword: Geom=AllCheck
keyword: Guess=TCheck
keyword: SCRF=Check
keyword: GenChk
keyword: RMN15/def2SVP
keyword: Freq
converged: YES YES NO YES
title: Mulliken charges:
elementType: C O C O N H C H C H C O O H H C H C C C C C C H H H H C C C C C C H H H H C H H H O H Na
charge: 0.257952 -0.291168 0.240304 -0.324018 -0.097522 0.162890 0.059224 0.018805 0.014940 0.022451 0.105920 -0.358228 -0.397151 0.051876 0.046918 0.056357 0.068652 -0.064076 0.066847 -0.041646 0.001089 0.000562 -0.032749 -0.008409 0.008978 0.009678 -0.012031 0.004740 -0.013883 -0.037787 0.064200 -0.057449 -0.011063 0.027468 0.029961 0.011250 0.006257 0.081810 0.030698 0.025026 0.010330 -0.340455 0.172752 0.429698
chargesum: -0.00000
title: Mulliken charges with hydrogens summed into heavy atoms:
elementType: C O C O N C C C O O C C C C C C C C C C C C C C O Na
charge: 0.356746 -0.291168 0.240304 -0.324018 0.065368 0.078029 0.037391 0.105920 -0.358228 -0.397151 0.125010 -0.064076 0.066847 -0.050054 0.010067 0.010240 -0.044780 0.032208 0.016078 -0.026537 0.064200 -0.057449 -0.004806 0.147864 -0.167704 0.429698
1716.lowfreq: -9.4340 -0.0009 -0.0006 -0.0004 3.7801 11.5996 15.3993 27.9457 56.8833
frequency: 14.6467 26.4839 56.7654 70.4803 85.1663 97.4012 110.6582 123.9892 132.3557 138.0611 155.0809 165.1836 184.3023 206.9630 212.3471 215.4702 242.6334 254.6358 274.3784 281.0755 301.1989 309.1642 321.9931 349.2464 386.8254 415.3740 429.4121 444.4762 459.0206 472.2955 479.7470 510.3026 517.7855 559.8505 579.1785 582.1731 613.4126 643.3931 664.2605 680.8803 724.5128 733.9636 761.4912 770.6689 773.1785 782.6521 793.0079 803.8310 806.8891 819.9500 860.6582 893.7515 912.8953 917.4583 940.8328 959.9122 993.2620 995.8148 999.0531 1006.1918 1014.8690 1031.6082 1033.7453 1041.2045 1042.5077 1045.3541 1058.3377 1094.5127 1105.4910 1115.4873 1133.8417 1134.4127 1138.0560 1149.4051 1179.5549 1187.0603 1213.7014 1226.2217 1239.1688 1250.2830 1267.7676 1284.1245 1295.6708 1309.9491 1318.2558 1325.6430 1333.6340 1363.7926 1365.5165 1372.1960 1391.7246 1398.0586 1418.0182 1432.6358 1435.2304 1455.1764 1474.6611 1480.8118 1489.1252 1514.1216 1531.6139 1561.6145 1651.9153 1666.3052 1682.6923 1694.3541 1716.7457 1782.4505 3036.7303 3077.8605 3081.1452 3124.5553 3127.9204 3173.3413 3188.9589 3206.7735 3223.8879 3228.4062 3228.7801 3234.0667 3237.6469 3243.1725 3248.0746 3252.9599 3553.8261 3593.8386
redmass: 5.6915 6.1597 6.3980 7.4241 5.8798 4.8748 5.7470 6.4263 8.4465 5.6451 4.7353 5.8141 7.2101 4.5812 5.0932 6.4613 1.1962 3.5521 5.1639 10.7947 4.8880 5.0387 3.3344 5.7005 7.4901 6.0850 3.2363 3.0788 2.7990 1.8233 2.3425 4.5445 3.8271 4.2707 4.2757 3.6451 6.8143 1.2890 2.6050 4.1161 4.1882 4.6283 1.6670 1.7077 3.4463 5.2183 5.6832 7.1553 2.9194 2.1876 2.9763 2.6486 1.4571 1.6514 2.2248 2.8279 2.3261 1.5186 1.4780 3.0670 2.5718 1.9600 1.4091 1.3756 1.8565 1.6985 3.1327 2.0775 1.6041 1.3373 2.2207 1.1935 1.1288 1.2913 1.5408 2.6921 2.1856 2.3734 1.7941 1.7017 1.3670 1.5027 2.4789 1.3095 2.4234 1.5972 1.7205 1.3469 1.3593 5.6861 1.3733 4.6815 1.1284 1.1143 1.1048 1.7164 2.6666 3.0563 8.8759 3.3553 4.5607 3.2670 7.2869 7.7588 7.9388 7.9334 9.8358 11.3412 1.0852 1.0378 1.0841 1.0872 1.0644 1.1039 1.1054 1.1064 1.0881 1.0911 1.0899 1.0908 1.0956 1.0951 1.1000 1.0997 1.0668 1.0778
irintensity: 0.7852 0.9302 2.9826 3.9804 1.9903 1.1495 3.1631 5.0204 17.2030 0.8869 6.4162 9.9436 13.7868 5.5457 24.4129 13.7100 3.7538 4.6650 28.2768 30.7346 6.5344 21.9626 29.1005 20.7169 13.0920 2.8210 25.0075 20.2444 18.2291 143.7021 23.9431 1.5706 5.6856 7.3210 3.0488 1.3722 12.1889 159.2835 99.9503 6.4637 1.3356 0.9472 32.9916 82.1930 31.2011 10.5611 11.1203 97.9398 14.7438 2.3848 15.8592 10.5905 1.4490 3.7547 6.1062 12.3365 32.0809 5.8877 2.3569 4.9316 17.2176 12.9595 1.6069 0.4542 8.5028 10.0421 15.6509 29.3740 7.6031 0.5911 18.6299 2.9929 1.1315 4.2531 10.1386 44.9620 92.0640 72.9218 4.9090 28.8284 57.3308 31.5892 6.2632 295.9506 9.8521 2.0230 135.7331 0.2893 58.4788 32.2753 8.5144 0.4830 39.1069 3.1397 6.7486 127.3628 47.7973 40.4226 301.6007 10.0217 6.1271 881.4946 1.5845 0.7569 8.6369 0.9562 729.9941 799.6102 86.7045 18.2846 1.0628 44.6343 39.5864 38.4230 22.3822 12.1986 4.6628 0.5597 4.5596 0.5466 18.2950 5.7749 20.3484 7.2052 458.8400 175.5139
temp: 333.150 k
press: 1.00000 atm
elementType: 6 8 6 8 7 1 6 1 6 1 6 8 8 1 1 6 1 6 6 6 6 6 6 1 1 1 1 6 6 6 6 6 6 1 1 1 1 6 1 1 1 8 1 11
symmnumber: 1
zpe: 906342.4 jmol-1
zpe.correction: 0.345208 hartree
zpe.thermalcorrener: 0.373192 hartree
zpe.thermalcorrenthalpy: 0.374247 hartree
zpe.thermalcorrgfe: 0.283730 hartree
zpe.sumelectzpe: -1325.423510 hartree
zpe.sumelectthermal: -1325.395526 hartree
zpe.sumelectthermalent: -1325.394471 hartree
zpe.sumelectthermalfe: -1325.484988 hartree
dipole: 6.9722 -0.5010 3.8641
dipole: 7.9871
quadrupole: -148.2106 -137.5975 -140.7200
quadrupole: -17.4630 0.6576 4.7736
quadrupole: -6.0346 4.5785 1.4560 -17.4630 0.6576 4.7736
hfenergy: -1325.7687177 hartree
pointgroup: C01 [X(C19H18N1Na1O5)]
dipole: 2.743083 -0.1971236 1.5202373 debye
polarizability: 233.5323723|-45.786602|393.0115053|23.8727376|-0.0402181|314.1757551 unknown
InChI: InChI=1/C19H18NO5.Na/c1-11(21)17(18(22)23)20-19(24)25-10-16-14-8-4-2-6-12(14)13-7-3-5-9-15(13)16;/h2-9,11,16-17,20-21H,10H2,1H3;/q-3;+3/rC19H18NNaO5/c1-11(22)17-19-21(25-19,26-19)24-18(20-17)23-10-16-14-8-4-2-6-12(14)13-7-3-5-9-15(13)16/h2-9,11,16-17,20,22H,10H2,1H3
charge 0 multiplicity 1
44 atoms
C  1.28022489 0.41151347 2.67905597
O  -0.05234873 0.80845199 2.37263544
C  -0.83227795 -0.0469884 1.70129896
O  -0.59418931 -1.25332764 1.63444758
N  -1.8884294 0.57177237 1.14786079
H  -1.8294779 1.58929814 1.08641695
C  -2.85156367 -0.09352272 0.28575214
H  -3.63148673 -0.60568106 0.87001829
C  -3.48745913 0.9782536 -0.62041899
H  -4.07938923 0.4320045 -1.38115801
C  -2.14014075 -1.13000093 -0.5963059
O  -2.46252082 -2.33499205 -0.52151974
O  -1.20378208 -0.67546778 -1.31837401
H  1.62182672 1.1431507 3.42094405
H  1.28555441 -0.58603168 3.14425021
C  2.19642212 0.44316619 1.4459114
H  3.20668508 0.68288736 1.8243184
C  1.78769365 1.46171533 0.40226594
C  1.72470608 0.86477412 -0.86908915
C  1.32421196 1.59801487 -1.98991964
C  0.96852317 2.93661949 -1.81733843
C  1.0224572 3.53213156 -0.54872389
C  1.4361855 2.80051922 0.56886049
H  1.27014812 1.12643218 -2.97450794
H  0.63838558 3.52557397 -2.67630079
H  0.73434438 4.57967303 -0.43246909
H  1.46528473 3.26692878 1.55717112
C  2.69643489 -3.14352103 0.09130051
C  2.48676938 -2.86744007 -1.27042872
C  2.17209954 -1.57008625 -1.69378116
C  2.07918762 -0.55467217 -0.73431945
C  2.30899285 -0.82727488 0.62869307
C  2.61254429 -2.1220104 1.04866754
H  2.93331071 -4.16262888 0.4051743
H  2.56327349 -3.67390737 -2.00345073
H  1.99283275 -1.35745151 -2.75064245
H  2.77919372 -2.34196201 2.10660691
C  -4.4097447 1.91442426 0.13521087
H  -4.79022119 2.68933743 -0.54605318
H  -5.26513176 1.36569768 0.5543353
H  -3.87864039 2.41734001 0.95894196
O  -2.46375506 1.73766431 -1.22251181
H  -1.76611389 1.088996 -1.4733568
Na -0.08632114 -2.49114075 -0.23950535
