program: Gaussian 16
title: smd(2-propanol)-mn15/BS1
version: ES64L-G16RevA.03
method: RMN15
basis: GenECP
operation: Freq
keyword: #N
keyword: Geom=AllCheck
keyword: Guess=TCheck
keyword: SCRF=Check
keyword: GenChk
keyword: RMN15/GenECP
keyword: Freq
converged: YES YES NO YES
title: Mulliken charges:
elementType: C C C C C C H H H H C C H H H C C C C H C H C H H C H H H C O O C H H H Pd Na O C O C H O C O C H C N H H C H C C C O O C H C H C C H H C C C O H H H H H H H H H H H H
charge: -0.029312 0.074218 0.004434 -0.023087 -0.027775 -0.070157 -0.009377 -0.006776 -0.006128 -0.010652 -0.203453 0.082630 0.022021 0.036307 0.041451 0.082224 -0.079912 -0.048284 -0.032041 0.278678 -0.023567 -0.010463 -0.045173 0.007047 -0.002886 0.149110 0.027089 0.030892 0.026627 0.225454 -0.357206 -0.292241 0.088529 0.041861 0.041439 0.022023 0.003800 0.432748 -0.322855 0.154727 -0.294539 0.082890 0.071119 -0.381139 0.180012 -0.287803 0.078253 0.034059 0.149407 -0.097273 0.040058 0.022433 -0.105852 0.167806 0.150239 0.004676 0.008147 -0.274237 -0.317984 -0.008485 0.020869 -0.027896 0.021756 -0.181063 0.091534 0.021713 0.021032 0.101340 0.078864 0.074629 -0.213367 0.026798 0.020211 -0.005513 0.026669 0.021603 0.023662 0.024288 0.028686 -0.001724 0.236128 0.044736 0.051294
chargesum: -0.00000
title: Mulliken charges with hydrogens summed into heavy atoms:
elementType: C C C C C C C C C C C C C C C C O O C Pd Na O C O C O C O C C N C C C C O O C C C C C C C O
charge: -0.038689 0.067442 0.004434 -0.029215 -0.038427 -0.070157 -0.203453 0.182408 0.082224 0.198765 -0.058747 -0.024994 -0.026453 -0.045173 0.233717 0.225454 -0.357206 -0.292241 0.193852 0.003800 0.432748 -0.322855 0.154727 -0.294539 0.250039 -0.381139 0.180012 -0.287803 0.112312 0.211899 0.070533 -0.105852 0.150239 0.025545 0.029903 -0.274237 -0.317984 0.013228 -0.006864 -0.181063 0.091534 0.142835 0.150798 0.125879 0.022761
chargesum: 0.00000
1716.lowfreq: -1249.7470 -4.7501 -0.0010 -0.0006 0.0004 5.7208 8.6882 17.9902 18.8501
frequency: -1249.7470 17.2919 18.0850 34.0757 35.7782 36.6154 37.9671 44.4346 48.6805 50.9289 55.2482 57.4187 63.1480 71.7255 76.8737 88.1837 93.7073 100.6220 103.0342 110.9946 112.0903 114.1308 121.0252 131.2029 143.0654 146.8694 148.2146 155.0704 165.0071 176.0803 179.5100 191.4098 198.0405 206.4626 213.7248 218.7412 228.7976 239.2665 243.7256 258.6958 262.4759 270.9687 284.9214 299.2390 303.1221 309.4651 311.3717 317.3291 321.7178 325.3592 329.6243 341.2889 344.4539 348.5616 356.6354 363.2840 387.1220 390.7120 399.0432 406.6860 413.0615 416.6156 418.1152 422.3052 423.7610 428.7734 436.8093 456.8318 477.6435 486.1195 503.2044 509.1570 520.4079 529.4479 559.5512 569.1350 574.3911 575.9048 616.8795 622.8633 631.9978 635.1970 637.2869 667.6439 673.0748 703.9655 717.4027 732.1537 737.5148 750.5352 759.7368 760.9627 792.5514 795.7725 802.7971 823.1204 839.7899 841.2942 849.8183 854.7034 863.6374 864.1622 868.4246 873.5964 890.7734 895.2636 911.8321 918.9338 926.0513 929.9655 932.0028 946.2453 975.3053 982.2201 984.5738 985.1184 986.4765 989.8113 1007.8255 1010.5419 1011.0509 1012.7071 1013.7308 1017.0865 1025.3579 1030.2548 1030.8363 1037.5762 1044.4336 1049.3703 1060.5650 1078.9414 1092.8334 1096.2403 1109.0212 1115.8372 1129.6456 1145.6690 1152.8008 1164.0398 1168.7209 1171.6121 1172.2525 1174.7657 1196.1640 1224.5526 1227.6658 1238.7476 1251.4138 1253.7658 1256.5795 1257.7493 1270.7078 1276.7136 1286.6173 1301.4733 1306.6977 1310.3404 1314.5847 1332.1900 1335.0356 1356.0685 1360.1881 1362.2797 1364.3907 1369.3285 1373.2351 1373.3080 1374.1519 1375.5025 1377.6671 1389.9857 1405.3901 1406.7614 1408.7254 1415.8261 1416.1098 1417.4147 1419.0511 1420.5765 1421.6235 1423.0622 1425.2612 1435.2288 1437.9790 1441.3107 1441.8842 1445.7487 1448.2758 1450.4436 1462.8951 1511.5152 1523.0804 1526.3083 1548.3202 1559.3336 1636.5246 1650.4481 1656.1122 1673.9768 1683.3467 1692.5202 1695.9428 1722.0098 1757.0173 1792.3006 3068.6233 3073.5496 3073.5866 3075.8190 3078.3643 3083.9274 3089.6656 3093.1671 3107.9742 3157.1157 3157.3272 3161.0208 3171.1630 3175.6194 3178.0646 3179.6705 3180.0193 3181.2314 3184.4481 3185.4913 3187.3191 3191.3085 3193.3547 3198.0644 3209.4839 3211.0722 3221.2844 3223.1350 3223.8451 3226.8003 3227.6539 3233.8951 3235.8870 3249.3210 3250.4204 3627.0922 3834.5769
redmass: 1.1328 5.4344 5.7952 3.8470 6.4322 2.4458 1.4573 1.1121 4.3907 3.5779 3.9889 4.1858 5.1319 3.9552 4.7861 4.4965 5.2439 6.0677 6.3940 6.3307 6.5217 4.0291 7.0846 5.1445 6.2209 5.1533 1.4280 4.5994 6.8571 7.0779 7.1890 6.9662 5.4507 4.9823 5.9612 6.8894 5.1220 1.0594 4.7002 5.7376 5.5523 4.2521 5.0631 3.7465 1.5322 2.7890 1.7379 2.8182 2.8362 4.4385 3.2037 1.6377 1.7895 2.5247 2.6604 3.0925 4.6574 3.4936 2.4284 1.3060 2.3412 4.8925 3.1078 2.9179 2.9757 2.9722 5.1744 2.3424 4.8677 1.3531 3.8919 4.4191 3.5195 4.2756 3.0832 3.3247 4.0407 3.9061 4.5556 2.6122 6.4450 6.5913 6.2268 5.9192 6.4158 3.5338 5.6074 3.8276 3.3732 3.7754 4.2030 5.5925 4.2042 3.1228 4.5408 5.1887 4.4751 1.5104 2.3564 1.2936 2.5219 1.3668 2.0354 3.3203 3.0163 2.8816 2.8561 1.6501 1.9362 1.5868 1.5177 1.2194 3.3410 1.3676 1.3747 1.4984 1.4147 2.0892 1.5161 1.4173 1.9972 2.5658 1.6882 1.4259 1.4965 1.5579 2.5708 1.9292 1.6332 1.6161 2.8450 1.9797 1.4120 2.3599 2.0123 1.3183 1.2790 1.7790 1.0924 1.4402 1.4257 2.2883 1.3202 1.0874 2.5420 1.6508 1.9460 2.0783 2.7131 3.3086 1.6579 1.9011 2.2611 1.9761 1.7794 1.2951 1.5417 1.3966 1.4119 1.2810 3.4820 5.3277 2.1219 2.2453 1.6011 1.4240 1.4241 4.9931 1.4846 1.5017 1.3246 1.0745 1.4899 2.2086 1.0457 1.4069 1.4289 1.0580 1.0405 1.0542 1.0471 1.0834 1.2232 1.2151 1.1360 1.2151 1.6073 3.5702 1.0759 2.3574 3.3946 4.4019 5.7489 3.3266 3.2433 3.8088 6.6391 7.2240 6.9500 7.2378 7.3699 7.3226 7.3962 12.3969 12.0491 11.8736 1.0371 1.0368 1.0390 1.0387 1.0373 1.0373 1.0623 1.0373 1.0857 1.1029 1.1066 1.1032 1.1056 1.1047 1.1054 1.1048 1.1053 1.1050 1.1048 1.1051 1.1049 1.1029 1.0921 1.1043 1.0886 1.0882 1.0913 1.0899 1.0968 1.0914 1.0963 1.1081 1.0973 1.0960 1.0936 1.0802 1.0661
irintensity: 4688.8011 0.2931 0.4071 0.2779 6.1493 0.2744 1.0190 0.8001 3.0556 1.0435 1.2462 0.5588 0.1384 0.1733 3.7294 2.1183 12.4287 0.9572 4.7675 4.7702 1.6820 1.2822 3.3983 1.7833 3.8576 7.3497 7.4653 10.6184 8.7973 28.4387 0.1479 5.5452 11.0049 1.2128 18.2219 27.7063 12.2974 1.0055 14.8386 8.3157 3.9094 0.1304 14.8533 7.9064 4.2999 8.2253 0.3511 6.2389 11.9736 6.3801 25.8560 5.0183 0.6441 6.6289 4.2053 0.9428 25.9938 12.1284 13.7663 115.5182 82.5891 22.3499 10.4531 1.1107 12.1720 1.2718 18.1704 14.2654 22.5631 136.5293 28.7881 14.9678 11.0356 9.6265 33.0470 53.9828 38.0576 24.8559 16.0328 7.2974 91.6807 0.6106 5.9930 56.4047 37.3761 16.7386 92.2791 4.2073 3.1089 13.4052 9.4742 22.8616 16.6576 29.8842 1.0729 10.1866 11.9715 40.3475 17.5129 4.9523 33.8876 7.8752 1.3127 15.7283 57.7291 22.0838 64.2978 10.8998 57.7904 16.3411 7.8262 0.3692 31.3682 4.1017 4.9603 1.4060 6.5131 4.5285 0.1661 19.2114 0.4587 15.2293 6.0508 1.4226 12.9014 18.1332 56.2910 18.9412 8.2894 9.4754 107.7228 1.1042 43.2114 46.9260 67.5662 23.6680 103.8794 318.3071 6.8279 104.6216 285.6128 268.8056 279.3594 2.1437 23.8829 51.3506 14.5051 1.0275 40.4578 67.7582 72.4751 30.7843 63.6401 42.6698 234.6199 4.9436 72.2561 71.5616 147.8802 20.1319 71.8898 6.2903 1.4477 58.6915 3.6517 43.3190 0.8602 39.8889 2.7617 38.3360 28.5500 43.3078 247.9208 303.5983 2.0999 42.8996 6.0236 1.8713 10.7165 12.0413 0.3093 19.3860 13.5074 36.4318 3.6684 23.7486 29.9152 379.2991 4.5826 24.9962 12.7530 189.8579 260.2713 1003.8674 56.7709 214.2599 15.5614 2.1591 19.9264 34.0618 767.1287 114.0769 13.7070 1093.0095 635.8239 691.5841 20.4516 10.6297 31.5639 29.8889 18.1711 20.6227 25.1302 0.9594 35.2150 15.6358 16.1814 12.2463 22.1911 7.3434 33.2070 17.5158 17.4349 26.3688 20.6793 20.2592 32.5831 1.5342 11.8543 12.8003 19.6519 11.0905 14.5261 6.0292 29.5886 4.8350 9.9160 4.0702 0.5510 1.1679 8.9031 143.2934 273.6846
temp: 333.150 k
press: 1.00000 atm
elementType: 6 6 6 6 6 6 1 1 1 1 6 6 1 1 1 6 6 6 6 1 6 1 6 1 1 6 1 1 1 6 8 8 6 1 1 1 46 11 8 6 8 6 1 8 6 8 6 1 6 7 1 1 6 1 6 6 6 8 8 6 1 6 1 6 6 1 1 6 6 6 8 1 1 1 1 1 1 1 1 1 1 1 1
symmnumber: 1
zpe: 1723313.5 jmol-1
zpe.correction: 0.656375 hartree
zpe.thermalcorrener: 0.713147 hartree
zpe.thermalcorrenthalpy: 0.714202 hartree
zpe.thermalcorrgfe: 0.559532 hartree
zpe.sumelectzpe: -2297.619546 hartree
zpe.sumelectthermal: -2297.562774 hartree
zpe.sumelectthermalent: -2297.561719 hartree
zpe.sumelectthermalfe: -2297.716389 hartree
dipole: 0.2080 2.9555 4.5328
dipole: 5.4152
quadrupole: -253.8969 -233.3109 -256.8715
quadrupole: -12.1597 2.0937 8.7803
quadrupole: -5.8705 14.7155 -8.8450 -12.1597 2.0937 8.7803
hfenergy: -2298.2759213 hartree
pointgroup: C01 [X(C33H38N1Na1O9Pd1)]
dipole: 0.0818513 1.1627863 1.7833518 debye
polarizability: 645.0210791|-7.2194808|593.8807386|61.6132938|-28.5810051|564.1176238 unknown
InChI: InChI=1/C17H17O2.C14H18NO5.C2H3O2.Na.Pd/c1-12-4-8-14(9-5-12)17(3,16(18)19)15-10-6-13(2)7-11-15;1-14(2,3)20-13(19)15-11(12(17)18)8-9-4-6-10(16)7-5-9;1-2(3)4;;/h4-11H,1-3H3;4-7,11,15-16H,8H2,1-3H3;1H3;;/q-1;;-1;2*+1/rC33H38NNaO9Pd/c1-20-8-13-24(14-9-20)33(7)26-17-10-21(2)18-28(26)45(42-22(3)36)43(35-41-30(33)44(35)45)29(38)27(34-31(39)40-32(4,5)6)19-23-11-15-25(37)16-12-23/h8-18,27-28,34,37H,19H2,1-7H3
charge 0 multiplicity 1
83 atoms
C  1.87674559 0.0979455 -3.62057445
C  2.27001458 0.31764853 -2.29571248
C  3.17051847 -0.5440859 -1.66224425
C  3.67877345 -1.62350343 -2.40213165
C  3.29590078 -1.8329458 -3.72369541
C  2.37941747 -0.97817702 -4.35871291
H  1.16257162 0.78318697 -4.08590585
H  1.84540309 1.17374061 -1.76393374
H  4.37360046 -2.32134738 -1.92449887
H  3.70672202 -2.68376167 -4.27531293
C  3.61090336 -0.39957519 -0.19754833
C  1.95030109 -1.22887458 -5.77755615
H  1.31299896 -0.4163876 -6.1537392
H  2.81920015 -1.32386748 -6.44693873
H  1.3811635 -2.16895502 -5.85622847
C  3.19177821 -1.66198739 0.56253736
C  1.8428694 -2.10298768 0.50229908
C  4.08699767 -2.39614003 1.33871405
C  1.43931168 -3.23152641 1.23158717
H  1.24116911 -2.16078876 -0.6803818
C  3.66251251 -3.52476805 2.05494877
H  5.13535289 -2.1005817 1.40789676
C  2.335777 -3.96458963 2.02325192
H  0.39584956 -3.55955468 1.15423839
H  4.39214845 -4.07690951 2.65459844
C  5.12016948 -0.13432806 -0.1550043
H  5.34669414 0.75866912 -0.7522051
H  5.46786505 0.04483947 0.87332538
H  5.67783479 -0.98561906 -0.5705543
C  2.91384814 0.8192808 0.42763356
O  1.84257823 0.6199849 1.13437581
O  3.34071315 1.96377631 0.24954605
C  1.88035655 -5.17426963 2.79023451
H  1.07791592 -4.91496076 3.49812744
H  1.47439648 -5.94229314 2.1135221
H  2.70673807 -5.62261214 3.35906368
Pd 0.46299382 -0.55628893 0.29012192
Na 1.01328301 2.72549183 0.61008677
O  -0.98920561 -1.58732671 -0.61408222
C  -0.63171138 -2.35919265 -1.56415912
O  0.57435837 -2.64765894 -1.77691478
C  -1.72108687 -2.92236611 -2.42437639
H  -2.33025956 -3.61040541 -1.81894471
O  -0.66828184 1.16488813 0.15626987
C  -1.86413139 1.13236155 0.64666597
O  -2.30484994 0.2599234 1.39032368
C  -2.73519577 2.34432242 0.27959063
H  -2.26588171 2.8507988 -0.57978041
C  -2.8010555 3.29718055 1.47958741
N  -4.06641712 1.89881701 -0.06447264
H  -3.42737093 4.15932425 1.20297398
H  -3.30357456 2.76211392 2.30179653
C  -1.43950701 3.76214912 1.93001046
H  -4.85661448 2.13164776 0.53461226
C  -4.22376838 0.92051925 -0.98486034
C  -0.74161018 3.08248116 2.94072736
C  -0.80744403 4.85902161 1.32066222
O  -3.30817429 0.50357439 -1.67886045
O  -5.49825691 0.48398593 -1.09840397
C  0.53563589 3.48379968 3.34159164
H  -1.20371196 2.21497664 3.42107655
C  0.46847172 5.27384336 1.71111203
H  -1.32496814 5.40545164 0.52689345
C  -5.87202243 -0.76639436 -0.43729891
C  1.1472925 4.59199975 2.73526393
H  1.06744954 2.94441657 4.13038835
H  0.95150098 6.13236048 1.23935804
C  -4.9029276 -1.88016314 -0.8112218
C  -7.26788179 -1.05336299 -0.95935621
C  -5.87616034 -0.53393228 1.06774231
O  2.37812267 5.02042156 3.07912035
H  -5.26447306 -2.82908333 -0.38722634
H  -4.8380685 -1.98566334 -1.90450928
H  -3.89456029 -1.68646761 -0.41473629
H  -7.66604395 -1.96586318 -0.49251323
H  -7.94262382 -0.21611121 -0.72587647
H  -7.24758539 -1.19567428 -2.05017169
H  -6.55862828 0.28983302 1.33001513
H  -6.21390122 -1.44313748 1.58702669
H  -4.86424115 -0.29050268 1.42593413
H  2.75037963 4.46760139 3.78656197
H  -1.30533737 -3.45544654 -3.2863488
H  -2.37294431 -2.09900581 -2.7486089
