program: Gaussian 16
title: (SMD = 2-propanol)-MN15/BS1
version: ES64L-G16RevC.01
method: RMN15
basis: GenECP
operation: Freq
keyword: #N
keyword: Geom=AllCheck
keyword: Guess=TCheck
keyword: SCRF=Check
keyword: GenChk
keyword: RMN15/GenECP
keyword: Freq
converged: YES YES NO YES
title: Mulliken charges:
elementType: Pd C O C C C C C H H C O O C H H C C H C H H H C C C C H C H C H H Na C H H H C H H H C H H C H H C O C H H H O C C C C H H H H H H H H H N C C H C O O H H C C C C H C H C H H O H
charge: -0.650510 0.205156 -0.310542 -0.011978 -0.062594 -0.149343 0.002339 -0.023239 -0.047599 0.015017 0.219635 -0.274388 -0.227409 0.219786 0.062963 0.235710 0.161293 -0.275996 -0.011134 0.171211 0.030245 0.021036 0.034648 0.048867 -0.013293 -0.004335 -0.025767 0.005706 -0.034082 -0.004121 -0.066170 -0.006707 -0.008053 0.498373 0.135347 0.049938 0.005985 0.032922 0.080124 0.041089 0.022512 0.041457 0.179699 0.061079 0.038059 0.009948 0.056619 0.062349 -0.006579 -0.252799 0.006536 0.027817 0.029596 0.034093 -0.300003 -0.179822 0.091384 0.078891 0.082619 0.028763 0.008826 0.023765 0.023800 0.021295 0.022181 0.008010 0.033209 0.024141 -0.144889 0.030953 0.167528 0.051292 0.175896 -0.332511 -0.368312 0.001720 0.011028 -0.044498 -0.021107 -0.018481 -0.023499 -0.036963 0.023900 0.026117 0.139224 -0.022868 0.028672 -0.221107 0.230332
chargesum: -0.00000
title: Mulliken charges with hydrogens summed into heavy atoms:
elementType: Pd C O C C C C C C O O C C C C C C C C C C Na C C C C C O C O C C C C N C C C O O C C C C C C O
charge: -0.650510 0.205156 -0.310542 -0.059577 -0.073728 -0.149343 0.017356 -0.023239 0.219635 -0.274388 -0.227409 0.282750 0.161293 -0.275996 0.257139 0.048867 -0.007587 -0.008457 -0.032474 -0.042136 -0.066170 0.498373 0.224193 0.185182 0.278837 0.128917 -0.006579 -0.252799 0.098042 -0.300003 -0.179822 0.152737 0.146167 0.147978 0.090821 0.082245 0.167528 0.188643 -0.332511 -0.368312 -0.044498 -0.058069 0.007635 -0.046366 0.052572 0.139224 0.009225
chargesum: 0.00000
1716.lowfreq: -0.0009 -0.0006 -0.0004 3.5397 5.7384 8.1513 14.9604 16.3349 24.3801
frequency: 14.8226 15.9040 24.0896 28.7830 32.3204 33.3510 36.0543 44.6854 49.9870 54.2229 58.6518 63.2865 73.6215 78.0754 88.0658 94.6461 99.3312 102.4848 111.7218 115.2815 118.2882 120.5669 126.9160 132.6593 135.0437 141.4953 148.9319 152.2633 162.7945 168.9741 179.5539 187.9677 194.8813 208.4290 215.2806 221.5884 227.5454 229.6410 234.5371 238.9991 242.2709 244.7592 264.9549 268.5381 275.3329 293.0744 302.5554 308.3597 315.7400 319.2029 326.4065 337.4963 340.8493 345.1248 358.1344 359.1894 368.5640 373.7525 374.7450 392.4797 414.1236 418.5841 419.8832 424.0660 433.7819 439.7646 443.7684 456.3793 457.3833 459.0297 462.0418 476.9512 500.4464 506.7478 530.6249 530.8213 557.6319 560.0993 584.8856 592.9860 600.9537 613.2949 621.8242 633.0379 641.5073 651.0240 666.3665 687.8975 709.7829 718.1596 732.9892 735.3437 747.0839 761.0002 773.0278 782.8805 784.4904 788.7342 811.3640 812.8861 820.9464 831.8313 837.4631 841.2468 848.4618 860.9889 868.5170 875.4967 880.5563 892.6190 896.4626 908.4112 921.6515 923.6477 927.1741 935.8805 942.1734 946.6568 954.2292 962.0016 983.4452 984.2418 992.9892 993.5904 998.8708 999.4155 1008.2586 1014.0720 1019.6044 1021.2106 1025.1953 1030.8982 1039.6794 1044.1800 1046.6875 1057.7488 1064.9862 1079.2989 1080.7523 1098.9881 1115.9715 1118.2164 1119.0767 1128.9089 1134.7419 1142.9995 1149.1679 1163.6512 1172.3772 1173.8000 1187.8550 1207.1635 1214.9036 1215.5004 1220.8368 1225.6614 1232.7029 1243.7944 1245.8037 1248.8562 1258.0305 1267.2455 1272.9986 1278.4099 1282.2140 1290.8870 1296.5943 1304.5742 1310.5231 1320.6867 1348.3226 1349.2302 1351.5781 1354.4339 1361.3695 1362.5646 1364.7787 1366.1063 1367.9657 1371.2129 1373.4493 1374.5434 1382.0929 1402.8221 1403.4197 1404.5387 1413.6198 1414.5638 1415.3033 1415.8965 1416.2462 1418.1141 1419.1693 1420.7613 1421.0090 1428.2076 1428.8752 1429.7469 1430.6380 1434.5988 1443.5281 1448.0999 1449.3860 1454.8071 1464.7770 1513.2622 1518.7824 1524.5507 1547.8280 1632.8116 1646.3249 1651.8804 1659.2486 1662.3444 1677.8902 1695.5173 1788.5294 1793.5420 1826.6984 3065.4669 3071.9569 3071.9848 3074.8259 3075.7401 3081.7638 3083.0683 3085.8024 3089.3881 3094.5920 3107.6227 3111.6345 3115.1659 3149.8195 3158.7852 3165.9998 3172.9778 3174.0488 3176.7737 3180.1016 3181.4985 3183.2198 3184.5601 3184.8300 3185.1403 3187.4990 3187.5738 3191.1672 3201.0596 3206.7651 3209.0855 3211.1142 3211.7296 3214.1123 3218.1336 3219.1895 3225.0358 3231.3527 3231.7886 3253.8379 3548.5740 3831.5526
redmass: 3.2452 3.9450 4.8597 3.3976 2.0901 1.8024 5.6421 4.5983 5.5836 4.6989 5.2162 4.2652 6.0424 6.7888 3.0955 3.1955 4.1098 5.0503 5.3255 7.1402 5.0816 4.1897 6.5446 3.0947 4.5159 3.5593 8.0609 2.6753 6.0329 4.7487 3.5006 6.1669 6.5006 6.3300 2.1947 3.8410 1.2194 3.6588 5.7624 3.7129 2.8210 3.3997 1.0996 3.3119 4.5440 6.5017 4.0585 1.1884 1.9518 2.5755 4.2554 3.3170 4.2426 1.6594 2.6923 2.6312 4.9637 2.7678 3.4722 3.1756 2.7633 2.9091 2.5913 4.6750 5.5720 2.7788 1.1436 2.9340 4.2110 3.2298 3.1494 3.7739 4.1958 1.4406 2.9095 3.0609 3.8524 2.6247 3.5869 4.7739 3.6859 3.9160 5.6749 6.6175 3.6826 4.6000 4.7088 4.0120 5.6235 3.7237 3.6827 3.9250 2.6852 3.3563 6.2507 1.9655 4.0147 6.8365 3.7219 1.5843 2.1231 1.9027 3.0543 1.7608 1.5086 2.1838 1.2611 1.6514 2.6613 2.6468 1.6590 2.8880 1.4914 1.5235 2.5588 1.2040 2.9988 1.4137 2.1717 1.4412 1.3866 1.3923 1.3792 1.4494 1.6648 1.9580 2.0413 2.8482 1.4160 1.3839 1.4421 1.6131 2.7369 1.9174 1.6381 1.2847 2.0988 2.2777 2.3814 3.6588 1.8186 1.1635 1.9289 1.5004 1.7814 1.2740 1.2485 1.5799 2.2159 1.1494 2.3879 1.5790 1.4866 1.4789 1.5681 3.0727 2.4187 1.6286 1.2717 3.4481 2.0939 2.0602 2.8892 1.4658 1.3449 3.0560 1.8664 1.3445 1.6518 1.7844 1.5027 1.8328 1.1799 3.9385 2.0420 1.5294 1.3895 1.7152 1.4739 1.3693 1.5689 1.4978 2.9847 1.3257 1.1518 1.3546 2.5639 1.2351 1.4555 1.3239 1.3255 1.0575 1.0434 1.0691 1.0893 1.1516 1.0360 2.7424 1.1197 1.1093 1.3386 1.1026 2.3160 2.6140 8.2746 4.0489 3.7727 4.2348 3.1609 7.1810 7.1177 7.3300 7.3641 6.9550 11.6705 7.2592 11.7432 11.2414 12.7859 1.0395 1.0654 1.0392 1.0389 1.0373 1.0366 1.0395 1.0381 1.0651 1.0837 1.0848 1.0642 1.0995 1.1013 1.1030 1.1030 1.1045 1.0901 1.1050 1.1046 1.1050 1.1043 1.1043 1.1022 1.1049 1.1049 1.1058 1.1050 1.1034 1.0884 1.0892 1.0926 1.0921 1.1026 1.0890 1.0961 1.0966 1.0967 1.0902 1.0944 1.0785 1.0662
irintensity: 0.2247 0.7896 0.4313 2.9203 1.1933 0.1898 0.0089 0.6705 2.0175 1.6824 0.6940 2.2399 0.1552 3.3656 4.2365 1.3643 2.9889 1.5183 6.5599 2.7675 3.8192 1.4565 22.9804 4.3004 1.8059 2.7029 41.7973 3.3259 8.2361 6.2317 0.7019 5.0970 0.6107 4.2313 23.4807 23.8398 4.4772 13.5054 43.9830 18.6524 17.5488 1.0880 0.4225 23.6013 16.3133 25.2438 14.3461 3.7907 1.5843 10.1124 5.8524 7.5978 4.3394 1.0507 5.5179 6.7467 9.3512 13.9252 17.2121 1.0633 5.7902 0.6741 7.8699 1.5454 7.9826 2.2646 219.0675 2.8266 5.7777 4.9348 6.3305 2.8398 1.1354 109.5114 26.2655 48.6997 34.6565 13.1988 43.0247 7.3331 24.9063 30.1738 1.7813 1.1727 19.1583 43.0672 20.5019 9.4554 15.4287 7.9332 0.0953 28.0316 14.3988 7.5577 18.9986 8.7050 21.9713 39.8946 6.6339 9.3023 59.9538 27.3999 8.5421 20.9882 24.1704 44.5053 0.1865 4.9655 39.4323 21.3024 1.2261 16.6444 2.0092 1.9111 15.8122 0.2130 6.2393 10.9995 0.3963 0.7557 3.0894 7.8928 4.3514 8.7876 11.4874 4.3385 1.1588 23.2857 0.3452 0.3893 4.3358 9.6496 4.8067 24.4073 9.6002 40.2993 6.9047 5.3620 37.0196 103.8783 36.9734 54.4511 2.5352 14.4260 106.9905 5.8778 221.0293 38.1386 97.3976 5.8975 370.6045 12.8530 8.1781 52.2540 37.5158 113.1368 0.0809 75.2766 14.8326 2.0274 18.1368 23.3103 35.7758 6.2253 14.2176 121.2634 168.2536 9.4272 45.0261 14.8629 13.0583 148.5518 73.0168 4.5753 27.3388 58.9123 43.2194 32.0058 40.5045 26.2386 150.4482 37.3737 28.5250 6.0791 13.0795 39.8686 22.2949 7.4770 22.5536 4.5463 16.5531 1.6208 11.6965 6.6851 10.4862 22.0913 11.6838 65.1700 21.1854 1.0606 48.9504 1.7495 23.7673 2.7451 486.8714 69.8499 124.7993 920.3162 71.2802 293.8525 15.7994 1.7583 13.3083 37.6275 970.2884 3.3365 779.0312 351.1054 760.1750 20.3986 22.9484 22.2600 29.9794 17.8461 12.9296 17.5857 22.7487 34.4305 27.9624 11.4842 50.0740 1.3349 16.1770 13.5572 30.4543 16.3252 11.4660 35.2139 25.8366 8.3139 18.2553 33.1073 3.8066 19.6664 21.8930 23.0892 13.6504 12.3418 16.8846 7.1682 9.0758 2.4855 11.1554 8.4172 10.6096 18.5918 7.0615 5.7466 4.6522 253.3514 241.2873
temp: 333.150 k
press: 1.00000 atm
elementType: 46 6 8 6 6 6 6 6 1 1 6 8 8 6 1 1 6 6 1 6 1 1 1 6 6 6 6 1 6 1 6 1 1 11 6 1 1 1 6 1 1 1 6 1 1 6 1 1 6 8 6 1 1 1 8 6 6 6 6 1 1 1 1 1 1 1 1 1 7 6 6 1 6 8 8 1 1 6 6 6 6 1 6 1 6 1 1 8 1
symmnumber: 1
zpe: 1891158.0 jmol-1
zpe.correction: 0.720304 hartree
zpe.thermalcorrener: 0.779741 hartree
zpe.thermalcorrenthalpy: 0.780796 hartree
zpe.thermalcorrgfe: 0.620079 hartree
zpe.sumelectzpe: -2338.962603 hartree
zpe.sumelectthermal: -2338.903166 hartree
zpe.sumelectthermalent: -2338.902111 hartree
zpe.sumelectthermalfe: -2339.062828 hartree
dipole: -10.1705 2.3827 12.2583
dipole: 16.1054
quadrupole: -258.3063 -274.8879 -292.0462
quadrupole: 19.5931 12.8469 -4.5743
quadrupole: 16.7739 0.1922 -16.9661 19.5931 12.8469 -4.5743
hfenergy: -2339.682907 hartree
pointgroup: C01 [X(C36H42N1Na1O8Pd1)]
dipole: -4.0013806 0.9374251 4.8227918 debye
polarizability: 722.7081279|-5.4692162|590.7007299|17.7141055|36.1511851|619.1161266 unknown
InChI: InChI=1/C22H24O3.C14H18NO5.Na.Pd/c1-5-17(23)13-20-18-12-15(3)8-11-19(18)22(4,21(24)25-20)16-9-6-14(2)7-10-16;1-14(2,3)20-13(19)15-11(12(17)18)8-9-4-6-10(16)7-5-9;;/h6-12,20H,5,13H2,1-4H3;4-7,11,15-16H,8H2,1-3H3;;/q-1;-2;+3;/rC36H42NNaO8Pd/c1-8-23-18-27-36-26-16-11-20(3)30(36)47(36)28-21(12-15-25(39)29(28)47)17-24(37-33(41)42-34(4,5)6)31-44-38(43-23,45-31)46(27)32(40)35(26,7)22-13-9-19(2)10-14-22/h9-16,24,27-30,37,39H,8,17-18H2,1-7H3
charge 0 multiplicity 1
89 atoms
Pd 0.53151588 -0.96156945 0.29104213
C  3.99827654 1.06808707 -1.30420862
O  5.056835 0.73282242 -1.82069158
C  0.72463784 2.38636741 1.07946622
C  -0.27464907 2.50464443 0.09901367
C  -1.28155012 0.44930752 0.89904295
C  -0.30777156 0.36176538 1.92199639
C  0.72731292 1.3345208 1.99407472
H  1.51764561 3.13653144 1.1289855
H  -0.41229927 -0.35577224 2.74144965
C  -2.58561582 0.21952324 -1.54520182
O  -2.66571939 -0.75303885 -0.62987579
O  -2.66104567 -0.10300932 -2.71364798
C  -2.46520207 -0.48730982 0.77443661
H  -3.378736 0.02032258 1.12584448
H  1.96987909 0.84770626 -1.09859904
C  -1.28198132 1.55492572 0.00613735
C  -2.40354751 1.6316208 -1.02334726
H  -0.24685904 3.35107519 -0.58917837
C  -2.09068125 2.55533993 -2.19898637
H  -2.03243968 3.59818644 -1.85764566
H  -2.89317615 2.48598006 -2.9466798
H  -1.13909505 2.27393104 -2.67474169
C  -3.73601406 2.06315979 -0.38337557
C  -4.95135393 1.71113299 -0.98974292
C  -3.77034137 2.86340628 0.76275319
C  -6.16458622 2.14072306 -0.45564385
H  -4.95247131 1.09895386 -1.89739458
C  -4.98988738 3.29637574 1.29014883
H  -2.83724285 3.15563249 1.25194313
C  -6.20755011 2.9423627 0.69594099
H  -7.09971272 1.85092952 -0.94372337
H  -4.99419361 3.9232651 2.18640768
Na -1.22304139 -2.12892404 -2.08282984
C  1.81355606 1.21310306 3.02601844
H  2.78067844 1.01139583 2.53510824
H  1.61686827 0.3863309 3.72293767
H  1.9277496 2.14325931 3.60367805
C  -7.5224428 3.39860067 1.26449968
H  -8.10149558 3.96553589 0.51895236
H  -7.37815026 4.03970929 2.14527548
H  -8.14346504 2.54008565 1.56513668
C  -2.33085284 -1.83653666 1.5010345
H  -1.27139885 -2.01208147 1.74865795
H  -2.91550974 -1.81019069 2.4291837
C  -4.01368051 -3.7231799 1.00000867
H  -4.79680632 -2.94270324 0.99630465
H  -3.93058769 -4.02484392 2.05948322
C  -2.73584854 -3.02465845 0.6529681
O  -2.02814766 -3.3951759 -0.27680416
C  -4.35050444 -4.88743004 0.09091437
H  -5.29429434 -5.36086584 0.3952529
H  -3.55945114 -5.65104304 0.11953474
H  -4.45568808 -4.55521457 -0.95254808
O  3.87538585 2.00035191 -0.34382948
C  5.02307017 2.71825371 0.18509482
C  5.95433086 1.74576905 0.89815478
C  5.72730558 3.49336038 -0.92236311
C  4.40955881 3.68802121 1.18541167
H  6.4215991 1.04797532 0.19090898
H  5.39311009 1.17155251 1.65358622
H  6.74853281 2.30678365 1.4132085
H  6.4825649 4.15758706 -0.4761967
H  5.00132573 4.11696171 -1.46678724
H  6.22472166 2.82310944 -1.6336335
H  3.86962153 3.14217751 1.97365982
H  3.70767049 4.36976572 0.68102182
H  5.20062522 4.28905121 1.65682678
N  2.79116507 0.55509451 -1.63490867
C  2.64424351 -0.64381742 -2.43183499
C  1.15699454 -0.99853638 -2.53947917
H  3.00343401 -0.46874475 -3.46082764
C  3.42704033 -1.85691287 -1.86150622
O  0.31336438 -0.24824935 -1.94869997
O  0.84835505 -2.0303094 -3.17719851
H  4.50061679 -1.67179225 -1.99932877
H  3.14324826 -2.72844462 -2.47085129
C  3.11620869 -2.07328543 -0.40939748
C  3.95387472 -1.61185695 0.59398514
C  1.85715369 -2.65208039 -0.03993355
C  3.59604718 -1.69534044 1.96092694
H  4.9159252 -1.16724577 0.31980674
C  1.4664487 -2.69772098 1.32492516
H  1.31877713 -3.2528473 -0.783347
C  2.36068618 -2.20744179 2.32088703
H  4.27737544 -1.33791274 2.73920226
H  0.62600948 -3.3180887 1.65083131
O  1.93259066 -2.28542815 3.60658919
H  2.61086367 -1.93671262 4.20896856
