program: Gaussian 16
title: (SMD = 2-propanol)-MN15/BS1
version: ES64L-G16RevC.01
method: RMN15
basis: GenECP
operation: Freq
keyword: #N
keyword: Geom=AllCheck
keyword: Guess=TCheck
keyword: SCRF=Check
keyword: GenChk
keyword: RMN15/GenECP
keyword: Freq
converged: YES YES NO NO
title: Mulliken charges:
elementType: Pd C O C C C C C H H C O O C H H C C H C H H H C C C C H C H C H H Na C H H H C H H H C H H C H H C O C H H H O C C C C H H H H H H H H H N C C H C O O H H C C C C H C H C H H O H
charge: -0.120751 0.269533 -0.151024 -0.019303 -0.044431 0.110168 -0.086141 -0.077011 -0.017107 -0.038529 0.235770 -0.367004 -0.315712 -0.066281 -0.035860 0.242790 0.022472 -0.171780 -0.001413 0.159768 0.025709 0.013406 0.059463 -0.005181 -0.027467 -0.004384 -0.036326 -0.011627 -0.043676 -0.009744 -0.067075 -0.014199 -0.016093 0.505085 0.093033 0.030277 0.019184 0.045416 0.080358 0.020247 0.039781 0.035254 0.095290 0.031511 0.060382 0.018958 0.044825 0.035852 -0.040220 -0.226287 0.011813 0.025766 0.024669 0.023286 -0.263653 -0.196031 0.082905 0.080634 0.078847 0.030255 0.035642 0.040878 0.033666 0.038417 0.036035 0.036612 0.025860 0.032483 -0.242536 -0.002078 0.207751 0.052485 0.183549 -0.389170 -0.322877 0.025834 0.010502 -0.099513 0.003224 0.087918 -0.072374 0.004560 0.029364 -0.008737 0.098975 0.017403 -0.040981 -0.227077 0.225793
chargesum: -0.00000
title: Mulliken charges with hydrogens summed into heavy atoms:
elementType: Pd C O C C C C C C O O C C C C C C C C C C Na C C C C C O C O C C C C N C C C O O C C C C C C O
charge: -0.120751 0.269533 0.091766 -0.036411 -0.045844 0.110168 -0.124671 -0.077011 0.235770 -0.367004 -0.315712 -0.102141 0.022472 -0.171780 0.258345 -0.005181 -0.039093 -0.014129 -0.050525 -0.059769 -0.067075 0.505085 0.187910 0.175641 0.187183 0.099634 -0.040220 -0.226287 0.085533 -0.263653 -0.196031 0.189680 0.188752 0.173802 -0.242536 0.050406 0.207751 0.219885 -0.389170 -0.322877 -0.099513 0.007784 0.079181 -0.054971 -0.011617 0.098975 -0.001285
1716.lowfreq: -8.8174 -5.5772 -3.1814 -0.0011 -0.0006 -0.0003 13.1644 17.3032 24.9660
frequency: 13.0037 16.7067 24.8221 25.2180 30.3420 32.8178 36.9578 42.8966 44.8108 52.1206 54.5703 57.6808 59.6624 62.6866 67.2601 76.2106 80.1183 86.3966 92.2474 100.5369 107.7332 116.9857 124.2483 135.7311 143.1602 148.7926 150.7542 158.1137 165.0402 176.0318 180.2829 186.3792 190.8960 199.0003 202.3023 206.7544 212.1628 215.5430 226.4012 228.9484 242.9792 250.8901 262.5891 268.4658 273.8339 280.8125 282.5489 289.4186 298.6754 308.1468 320.3083 330.0895 331.4121 343.2965 348.8013 356.3367 360.6918 376.5141 385.0213 391.1076 393.3271 410.8422 420.9512 424.0496 432.5066 434.4345 437.6492 444.8996 448.4173 455.4238 465.7657 473.2913 479.1659 510.3546 513.9994 558.0997 566.9437 579.2036 580.2009 585.0031 612.7053 617.4774 632.3350 634.4467 634.4978 652.2868 665.8711 670.4669 715.9640 726.2655 727.9290 741.3499 744.5172 750.6335 756.0998 758.6830 762.6143 788.6848 794.1630 820.1318 827.6711 843.7100 852.2360 855.8892 858.2119 858.9924 866.9345 871.6568 884.3847 886.6487 897.1978 899.6813 913.9745 917.5882 920.8855 927.2023 941.9440 951.8833 960.7075 980.6923 988.2188 993.9094 998.7095 1001.6330 1003.3498 1004.7484 1010.2171 1013.9630 1021.6842 1022.8781 1023.4955 1023.9756 1025.7904 1032.9338 1037.0619 1045.1106 1050.9942 1066.3731 1071.6632 1085.2948 1089.0531 1113.6779 1115.5029 1125.2574 1136.0228 1139.3490 1146.9758 1156.1391 1161.3180 1166.1697 1174.2528 1177.1027 1185.1345 1192.1441 1219.0437 1222.2918 1230.5502 1241.2268 1248.3305 1252.8437 1258.1535 1262.5627 1263.1975 1270.3747 1287.3799 1299.1054 1301.8299 1303.8245 1318.7518 1333.7554 1336.5557 1343.9027 1352.6176 1353.9012 1362.6797 1364.0588 1365.9724 1372.8931 1374.2361 1374.4399 1375.6196 1377.8544 1383.1043 1404.1648 1404.4376 1405.2856 1408.6714 1413.1100 1415.1922 1415.2510 1417.2539 1420.0827 1421.2589 1424.2359 1429.7638 1430.6817 1431.0518 1435.0001 1441.9279 1443.9571 1446.8041 1447.4650 1458.6472 1460.9027 1465.4246 1530.9625 1547.5106 1549.6829 1555.3885 1630.8327 1649.4290 1658.2319 1684.0355 1685.7529 1694.5217 1699.0972 1727.9831 1772.2716 1813.5171 3039.4471 3071.1482 3071.7821 3073.8563 3079.2442 3081.3830 3082.1512 3083.8838 3086.2732 3098.6383 3120.2070 3124.7332 3137.8659 3154.6496 3156.3579 3167.0188 3173.0698 3178.1635 3178.3229 3179.1874 3181.1780 3182.1375 3182.3575 3183.2531 3191.1189 3195.0311 3197.8578 3201.8372 3202.0390 3205.8946 3207.6998 3215.1369 3219.2558 3220.6663 3222.4546 3224.0024 3238.6465 3248.4312 3263.6300 3263.9575 3576.1825 3799.3686
redmass: 3.8057 3.6916 1.6644 2.3435 3.3199 3.3858 3.8275 4.0199 3.9765 2.8626 5.7107 1.2674 4.6414 3.6541 4.5861 3.6869 5.0217 6.6849 3.4221 5.2798 6.2453 6.1296 5.2077 2.7510 4.2562 5.3692 4.1769 5.3665 4.8411 4.0942 4.5554 3.0797 5.1179 3.7959 5.0565 1.6584 4.5008 4.0576 1.3473 1.2530 3.3597 7.4054 2.7384 4.0814 2.8247 1.3306 5.1148 4.8527 3.5105 3.4083 3.6692 3.2312 3.6296 1.4610 2.3710 6.3221 2.9508 3.8803 3.3787 3.6756 3.5621 4.4198 3.4166 2.9795 3.8944 3.8051 3.0058 3.2025 2.9371 3.1892 4.1666 2.1778 4.2967 3.4040 3.8062 4.2331 3.6144 3.8803 3.5729 3.6416 3.1477 4.0367 3.7556 6.3418 6.5044 1.4780 2.7531 3.9186 3.3497 3.8639 1.8956 4.1560 4.0106 2.8418 5.7342 3.9448 4.9398 3.1419 4.9749 4.8731 3.7178 1.4700 1.2600 1.6132 4.0561 2.2258 2.5441 1.2611 2.3049 2.3948 1.8012 1.8657 2.3908 2.3030 1.4755 1.5101 1.2056 3.0326 2.0894 1.3983 1.4559 1.3883 1.4875 1.5526 1.5913 1.7842 1.8583 2.6956 1.8481 1.5878 1.4605 1.4287 1.4412 2.3130 1.6392 1.6310 2.0342 1.9793 1.9734 2.1366 1.2884 2.4278 1.3562 1.8660 1.6918 2.7334 1.0963 2.2578 2.2820 1.3066 1.0929 1.3266 1.6123 2.2535 1.6555 1.8777 1.6108 1.9881 1.2702 1.6319 3.1298 1.9296 2.0456 2.0570 1.7462 1.6595 1.2865 1.3766 2.1825 2.7380 2.2811 1.8090 3.6747 1.4718 1.1138 2.0640 1.4312 1.3993 1.4530 1.4753 1.3221 4.4467 1.4838 1.1007 1.3487 1.6375 1.8200 1.1878 1.0816 1.3135 1.0493 1.0735 1.0700 1.5453 1.3554 1.0367 1.1672 1.1474 1.3368 1.0805 2.3468 4.2362 2.2561 3.2559 1.0808 3.3447 6.2780 3.2974 3.8119 7.3537 7.1974 6.9614 7.7253 10.0129 7.7638 7.4043 9.1096 12.4488 11.6150 1.0733 1.0391 1.0390 1.0653 1.0377 1.0374 1.0397 1.0383 1.0385 1.0629 1.0931 1.0969 1.0863 1.1028 1.1020 1.1055 1.1040 1.1046 1.1043 1.1055 1.1048 1.1046 1.1059 1.1048 1.1046 1.1050 1.1033 1.0903 1.1049 1.0890 1.0882 1.0919 1.0950 1.0916 1.0969 1.0899 1.0968 1.0933 1.0929 1.0812 1.0652 1.0661
irintensity: 1.2197 1.0356 1.3985 0.6632 1.5200 0.8192 0.0584 2.0314 0.4152 3.1934 14.1996 1.8011 11.4290 4.5132 0.1305 2.0079 7.3389 4.9176 6.1476 8.6295 3.0738 12.5620 6.8581 3.0179 3.3471 14.3825 8.2026 3.5796 4.5013 5.9187 0.1676 15.8436 0.9366 23.6526 11.9127 0.4049 7.2173 1.3761 1.0220 2.5378 10.0671 35.5384 7.9197 4.1071 32.4633 14.8503 20.5282 24.9721 1.1233 21.2823 59.5345 7.9465 60.2321 172.8704 3.2835 46.2453 5.9263 10.0884 9.4003 10.8310 16.3177 29.7844 7.3605 1.0878 1.6221 7.6267 0.4913 5.4758 17.3246 9.2135 2.5303 3.7719 4.3619 3.7399 3.4208 25.7012 4.4762 21.8575 23.7146 20.3747 3.3936 19.1883 83.7516 0.1553 0.1445 102.4643 12.4654 9.3396 19.1533 42.9155 38.6792 46.8339 6.4524 12.1633 91.6595 11.0719 17.1607 21.1854 17.9995 0.7998 48.5546 42.3228 1.1855 18.3195 33.5487 17.2383 10.9413 1.7893 3.7121 102.3695 15.4179 23.8323 26.7756 23.3986 3.0041 3.4435 0.0474 11.3786 3.6421 4.0313 0.6245 4.3343 2.3751 15.8591 4.4920 6.8530 2.2139 34.6609 21.4548 3.6052 1.4455 0.6203 1.0132 4.5199 19.7716 12.6766 17.6113 37.6040 14.4785 14.0157 9.6083 124.8220 16.3023 50.7361 9.2165 19.9777 26.1439 172.7421 464.6252 33.7089 3.1233 272.0968 70.2839 4.7720 9.6591 3.8663 7.7643 6.5771 14.1683 72.0628 37.3764 61.0647 59.2506 30.3526 30.8473 27.1871 4.7209 76.8376 86.5640 17.1967 41.5113 47.8126 16.8030 8.7837 28.7361 47.5039 42.5089 1.4627 25.3666 38.6283 35.2106 7.4878 26.1264 10.8675 72.3478 18.2007 276.3258 9.6132 3.0932 7.3549 1.9905 12.8394 16.9187 467.8805 23.0219 11.9533 14.9378 0.3589 113.9948 3.0868 35.3794 359.8412 7.2687 76.4335 12.4199 62.0737 406.8533 58.1939 298.3755 20.0071 7.7243 42.0570 227.1313 521.3167 303.0603 5.2611 1106.5815 1349.4309 347.0203 20.3749 32.9862 35.7199 16.3526 15.6842 17.0169 23.6205 26.2328 8.9577 22.0721 10.5398 6.6588 20.6085 16.6125 14.5309 14.6937 31.5810 30.6652 15.6391 20.8379 21.6712 13.9353 27.9620 26.8866 15.4508 24.9644 16.9802 16.8910 16.2714 33.7862 15.6722 24.8139 3.5043 14.7939 16.1076 6.7663 2.7897 7.8432 4.1917 7.8044 654.9509 271.1064
temp: 333.150 k
press: 1.00000 atm
elementType: 46 6 8 6 6 6 6 6 1 1 6 8 8 6 1 1 6 6 1 6 1 1 1 6 6 6 6 1 6 1 6 1 1 11 6 1 1 1 6 1 1 1 6 1 1 6 1 1 6 8 6 1 1 1 8 6 6 6 6 1 1 1 1 1 1 1 1 1 7 6 6 1 6 8 8 1 1 6 6 6 6 1 6 1 6 1 1 8 1
symmnumber: 1
zpe: 1889049.9 jmol-1
zpe.correction: 0.719501 hartree
zpe.thermalcorrener: 0.779613 hartree
zpe.thermalcorrenthalpy: 0.780668 hartree
zpe.thermalcorrgfe: 0.616794 hartree
zpe.sumelectzpe: -2338.913857 hartree
zpe.sumelectthermal: -2338.853745 hartree
zpe.sumelectthermalent: -2338.852690 hartree
zpe.sumelectthermalfe: -2339.016565 hartree
dipole: -3.8784 -7.1253 11.0721
dipole: 13.7260
quadrupole: -243.6533 -281.6346 -303.5003
quadrupole: 19.0419 -29.3067 -2.3506
quadrupole: 32.6095 -5.3718 -27.2376 19.0419 -29.3067 -2.3506
hfenergy: -2339.6333586 hartree
pointgroup: C01 [X(C36H42N1Na1O8Pd1)]
dipole: -1.5258827 -2.8033 4.3561185 debye
polarizability: 754.9873251|12.7723496|617.1082796|26.6841228|-72.3795814|571.7642311 unknown
InChI: InChI=1/C22H24O3.C14H18NO5.Na.Pd/c1-5-19(23)12-9-17-14-16(3)8-13-20(17)22(4,21(24)25)18-10-6-15(2)7-11-18;1-14(2,3)20-13(19)15-11(12(17)18)8-9-4-6-10(16)7-5-9;;/h6-11,13-14H,5,12H2,1-4H3;4-7,11,16,19H,8H2,1-3H3;;/q2*-1;2*+1/rC36H42NNaO8Pd/c1-8-26(39)21-31-28-19-23(3)11-18-29(28)36(7,25-14-9-22(2)10-15-25)33-44-38-45-32(41)30(20-24-12-16-27(40)17-13-24)37(34(42)43-35(4,5)6)47(31,38,45)46(33)38/h9-19,30-31,40,42H,8,20-21H2,1-7H3
charge 0 multiplicity 1
89 atoms
Pd -0.63054272 0.06630759 -1.0935727
C  -3.34376569 -0.42622774 0.15767688
O  -2.87657079 -1.54934906 0.6564156
C  2.26791873 -0.72998302 3.23999055
C  2.90258618 -0.66015145 2.00198615
C  0.91259452 -1.44646759 0.86636801
C  0.29984482 -1.51289172 2.13563686
C  0.94281958 -1.17515013 3.32826043
H  2.80541467 -0.42568167 4.14250017
H  -0.74638714 -1.82815436 2.20816733
C  2.35573976 0.44262547 -1.02160513
O  1.3336159 0.34251886 -1.80232534
O  2.74580539 1.53952247 -0.58972523
C  0.08173563 -1.74121692 -0.35026269
H  0.71247665 -1.83286938 -1.23249055
H  -1.90892864 -1.54259018 0.47023448
C  2.27328574 -1.04331904 0.80470146
C  3.03211617 -0.85321865 -0.53693426
H  3.92794621 -0.28864665 1.96954017
C  2.89005651 -2.02541209 -1.5461568
H  3.84420718 -2.18153631 -2.06801414
H  2.63268289 -2.96540617 -1.03449731
H  2.13887631 -1.82363458 -2.31928584
C  4.54390855 -0.70823646 -0.32699991
C  5.21716763 -1.7485702 0.34138019
C  5.32558979 0.29690974 -0.9026102
C  6.6027545 -1.76208502 0.45864419
H  4.63565784 -2.56666261 0.77771731
C  6.72142356 0.28008931 -0.78487096
H  4.85555295 1.10930543 -1.45669351
C  7.38796939 -0.73858676 -0.09960434
H  7.09075539 -2.58520416 0.98941109
H  7.30324754 1.08386425 -1.24593175
Na 0.93228356 2.70292923 -1.50228557
C  0.23813089 -1.28376102 4.65178376
H  0.50299176 -0.4479687 5.31610808
H  -0.85449247 -1.29546505 4.52528515
H  0.52067453 -2.21262652 5.17386656
C  8.8851514 -0.75123234 0.04040801
H  9.34951326 0.05465159 -0.54541203
H  9.18733713 -0.62084007 1.09199456
H  9.30993386 -1.70959127 -0.29657105
C  -0.67863768 -3.0712772 -0.29979324
H  -1.18541138 -3.30620561 0.65067944
H  0.06562697 -3.88708503 -0.39992196
C  -2.65937355 -4.39270746 -1.26093363
H  -2.12324243 -5.2825444 -0.88907721
H  -3.30742448 -4.07704908 -0.42292115
C  -1.64736658 -3.29023741 -1.43962548
O  -1.60167132 -2.61872967 -2.45831792
C  -3.46784659 -4.6847594 -2.51022902
H  -4.02433871 -3.79363693 -2.83555223
H  -2.81566341 -4.98974657 -3.34216633
H  -4.19180197 -5.49204932 -2.33012169
O  -4.59409563 -0.12805998 0.38916564
C  -5.41233423 -0.68480003 1.48321013
C  -4.70121835 -0.44708123 2.80677423
C  -5.70796843 -2.15362885 1.2197923
C  -6.68189554 0.14526018 1.39535863
H  -3.77313008 -1.03018704 2.8883369
H  -4.46835048 0.62222721 2.93035867
H  -5.36592161 -0.74999351 3.62887732
H  -6.07487594 -2.28984839 0.19133164
H  -4.82687403 -2.78897005 1.37706202
H  -6.49681141 -2.48444048 1.91128098
H  -7.38268174 -0.16478687 2.18312386
H  -6.45231313 1.21310256 1.52818306
H  -7.16641919 0.00509145 0.41790575
N  -2.58071555 0.3458658 -0.54725393
C  -3.09984105 1.67875355 -0.8668524
C  -2.24869685 2.36956864 -1.92487756
H  -4.13232675 1.60673757 -1.23983195
C  -3.08574691 2.59847282 0.38190657
O  -1.0753503 1.86482534 -2.12105887
O  -2.66669144 3.39366262 -2.4577882
H  -3.63640788 3.51479793 0.12296266
H  -3.63528858 2.09047513 1.1904692
C  -1.67862076 2.93654942 0.80008004
C  -1.08347483 4.14303909 0.40555419
C  -0.87535803 1.99766547 1.46774271
C  0.27287684 4.39781263 0.63447843
H  -1.68733066 4.89151943 -0.115546
C  0.48362214 2.22544602 1.68308445
H  -1.31573754 1.05542013 1.81158507
C  1.07118543 3.42450537 1.25266626
H  0.73086769 5.33956414 0.32097794
H  1.10305341 1.47193679 2.17831754
O  2.39406752 3.67098214 1.39388201
H  2.87392411 2.83209804 1.51291946
