program: Gaussian 16
title: (SMD = 2-propanol)-MN15/BS1
version: ES64L-G16RevC.01
method: RMN15
basis: GenECP
operation: Freq
keyword: #N
keyword: Geom=AllCheck
keyword: Guess=TCheck
keyword: SCRF=Check
keyword: GenChk
keyword: RMN15/GenECP
keyword: Freq
converged: YES YES NO YES
title: Mulliken charges:
elementType: Pd C O C C C C C H H C O O C H H C C H C H H H C C C C H C H C H H Na C H H H C H H H C H H C H H C O C H H H O C C C C H H H H H H H H H N C C H C O O H H C C C C H C H C H H O H
charge: -0.489197 0.203706 -0.307614 -0.003953 0.031471 0.189817 -0.068565 0.017235 0.026665 0.033301 0.175395 -0.369648 -0.351300 -0.181311 0.029247 0.210124 0.084446 -0.218522 0.019424 0.161271 0.028139 0.011962 0.014993 0.020841 -0.011584 -0.006454 -0.030336 -0.011549 -0.027660 -0.016477 -0.078456 -0.015054 -0.014734 0.503522 0.175309 0.043951 0.052721 0.037178 0.092439 0.030831 0.034317 0.020661 0.203405 0.023393 0.050287 0.028667 0.049473 0.023155 -0.078155 -0.258768 0.025361 0.004024 0.021141 0.023970 -0.296123 -0.178857 0.087307 0.077508 0.070899 0.025961 0.022661 0.035661 0.022967 0.026691 0.023017 0.023215 0.024515 0.028483 -0.143024 0.030543 0.166963 0.048666 0.199286 -0.345887 -0.340879 0.024712 0.003719 -0.065053 0.021640 -0.002537 0.021426 0.037172 -0.004140 -0.032735 0.148624 0.045797 0.000219 -0.206649 0.235730
chargesum: -0.00000
title: Mulliken charges with hydrogens summed into heavy atoms:
elementType: Pd C O C C C C C C O O C C C C C C C C C C Na C C C C C O C O C C C C N C C C O O C C C C C C O
charge: -0.489197 0.203706 -0.307614 0.022712 0.050895 0.189817 -0.035264 0.017235 0.175395 -0.369648 -0.351300 -0.152065 0.084446 -0.218522 0.216364 0.020841 -0.023133 -0.022930 -0.045390 -0.042394 -0.078456 0.503522 0.309160 0.178249 0.277085 0.101295 -0.078155 -0.258768 0.074496 -0.296123 -0.178857 0.171590 0.150183 0.147112 0.067100 0.079209 0.166963 0.227716 -0.345887 -0.340879 -0.065053 0.058812 -0.035272 0.067223 -0.003921 0.148624 0.029080
1716.lowfreq: -4.1836 0.0007 0.0008 0.0010 7.0320 8.1599 14.4649 23.9071 26.7388
frequency: 14.2739 23.8810 26.6083 29.6009 36.7528 39.9405 47.2334 52.4532 55.8358 66.3260 69.6982 78.3034 84.5969 88.5961 91.9010 92.4975 96.9545 105.8286 107.5913 112.7887 117.3143 122.9737 126.8265 134.4688 138.0277 139.4076 150.4486 157.8473 163.1945 171.9236 180.4300 189.0824 193.2906 202.0368 207.8777 219.8261 223.3000 228.5957 232.9082 238.9277 241.9486 256.7679 259.4703 260.1616 276.5077 284.0344 286.6953 288.5732 312.3611 314.5944 320.8476 328.4659 344.6937 349.6086 356.6942 363.8232 365.1178 372.0110 381.5503 389.7923 392.6258 404.2485 413.1804 419.2299 421.7707 423.4532 424.1010 430.6970 440.4967 447.8552 449.9318 455.5533 459.7382 470.1848 502.3541 509.4533 534.2286 539.9091 566.3444 581.9881 583.7531 597.8956 617.5090 619.4145 631.1884 631.9370 653.4605 689.7028 691.5054 708.7610 721.8656 732.8682 737.1822 746.5947 754.7061 771.8058 789.9319 792.1333 804.6124 817.3905 827.3225 829.1403 846.1292 852.7840 861.4408 863.1319 868.0472 873.2651 876.2780 881.7982 890.3854 904.8842 910.7323 921.6259 921.7062 923.4903 936.0742 949.9627 952.4237 954.8042 975.9019 979.4480 981.7193 987.9225 990.3701 999.4648 1001.5936 1011.8529 1012.7454 1016.4498 1016.9807 1019.6317 1026.1298 1033.0375 1034.5457 1039.8123 1043.7775 1051.4897 1066.6862 1087.9521 1099.0971 1100.2196 1113.7390 1115.9746 1125.0159 1142.6856 1142.9695 1148.8316 1159.0478 1160.8757 1169.0197 1189.9941 1192.8034 1209.2785 1220.8578 1222.2900 1239.7798 1242.8754 1243.9653 1257.9208 1259.3143 1267.3352 1269.2820 1285.1817 1293.7612 1299.0506 1304.3078 1319.0349 1322.1853 1329.4420 1339.6462 1350.3152 1354.1982 1359.7442 1361.1727 1364.3978 1365.6356 1371.2870 1372.8896 1373.6964 1386.3772 1395.2527 1402.8374 1403.7575 1404.7150 1409.2879 1411.2100 1412.8631 1418.6336 1419.3514 1420.4783 1422.1427 1423.2214 1425.9056 1428.4257 1434.0024 1434.7749 1437.8380 1440.4852 1443.3873 1446.7143 1449.1268 1453.2594 1454.1712 1494.8028 1527.7821 1546.8887 1550.7704 1576.9918 1645.3914 1651.0944 1658.3802 1676.4081 1684.1378 1685.0894 1696.1410 1704.7991 1786.3574 1818.2052 3066.5932 3071.1395 3072.9573 3075.5361 3076.8213 3077.3313 3078.7121 3078.9040 3083.2642 3102.8635 3123.2782 3142.5019 3148.4794 3162.7046 3168.4479 3169.0852 3170.9302 3171.0560 3175.0559 3175.2590 3178.7227 3180.0763 3182.7228 3183.2705 3187.3085 3197.6193 3199.3364 3203.9868 3206.2028 3208.5627 3208.6854 3211.6113 3211.8533 3214.9269 3222.4284 3229.7394 3231.7699 3238.2322 3238.5672 3270.8805 3556.5295 3833.5119
redmass: 5.6532 4.8848 4.6679 5.1117 4.8823 4.0558 5.5796 5.1223 6.1119 5.0704 7.8320 7.1244 6.1426 5.6778 3.3474 6.6535 7.0565 1.6573 3.2956 5.7889 7.9164 3.6503 5.1254 8.4205 1.5828 10.5544 7.7908 4.5158 7.2567 4.5617 1.1494 4.6446 3.7792 3.4746 1.6909 4.6962 3.8526 2.7773 5.1964 2.2824 3.5142 1.7160 2.5360 1.1020 3.6274 8.4007 1.0921 5.8593 6.0334 3.2854 2.7433 3.2440 2.4496 3.3753 2.6859 3.3228 4.1678 3.2841 3.2193 1.7301 2.8240 4.2625 2.8243 2.6848 1.3891 3.0618 3.1115 3.6916 3.8390 3.1402 1.7956 2.8539 5.9232 3.4977 1.9798 3.9094 2.2347 4.3478 3.4663 2.7238 3.7746 3.7634 3.7210 3.7427 6.3520 6.4810 3.5813 4.2805 2.2984 4.8223 4.0261 3.7136 2.2723 2.5972 4.0028 4.1263 9.6698 4.4286 3.7284 4.8435 3.4174 2.1547 1.5747 4.5777 1.2757 2.5877 1.2685 1.7481 1.9739 1.9370 2.7215 2.7866 1.7255 1.7567 1.4963 1.5493 1.2041 1.9869 2.9173 1.4742 1.3444 1.3822 1.3944 1.5661 1.5921 1.8213 1.6337 1.4227 2.4862 2.0671 1.4615 1.4183 1.4595 2.0328 1.8216 1.6317 2.0630 1.8852 2.2864 1.2659 1.8798 3.6093 1.4627 1.5415 2.3824 1.1911 2.2042 1.1674 1.5805 1.2631 1.0880 2.8039 2.9215 2.3499 1.4204 1.7258 2.0317 1.8062 1.3665 1.7360 2.0715 1.8519 1.5612 1.6259 2.0352 1.5650 1.2921 2.5947 2.0794 1.5683 1.8061 1.5226 3.4695 1.3748 1.1604 1.5364 1.4402 1.4149 1.3434 1.3587 5.6518 1.3250 1.5619 1.0515 1.1245 1.0665 1.2636 2.0349 1.0901 1.0550 1.2063 1.0605 1.0827 1.0425 1.1927 1.1108 1.5552 1.3326 1.6234 2.4274 2.2862 3.0307 1.5952 2.1698 6.2747 6.6033 3.6842 3.3765 4.8522 7.1286 7.2601 7.1657 7.1190 9.5293 9.8123 7.3741 11.6722 10.7391 11.6470 1.0398 1.0378 1.0719 1.0371 1.0376 1.0383 1.0401 1.0646 1.0390 1.0623 1.1003 1.0864 1.1016 1.1030 1.1063 1.1042 1.1040 1.1035 1.1054 1.1045 1.1048 1.1048 1.0883 1.1053 1.1048 1.1034 1.1041 1.0911 1.0893 1.0886 1.1038 1.0909 1.0905 1.0892 1.0961 1.0963 1.0950 1.0947 1.0927 1.0913 1.0771 1.0659
irintensity: 0.1437 0.7790 0.1113 0.5341 1.1485 1.0335 6.8752 5.8318 0.3833 0.7998 2.8400 2.9079 2.2684 0.7580 1.3880 10.3839 1.4736 1.4240 3.0456 3.3089 5.1599 4.2948 11.5905 7.8187 1.7928 1.3206 6.3831 0.0314 29.8181 3.7713 1.5883 11.2549 4.1421 0.7017 4.9653 5.2938 11.3766 2.4091 3.9100 5.8595 2.7098 0.8474 14.3497 0.9240 5.9127 85.2533 0.5609 23.8997 38.8546 12.3167 14.3145 28.7854 5.2113 12.8855 4.0021 1.1402 4.1390 10.0649 14.8112 16.3227 4.8340 13.0763 21.2266 35.5355 116.3922 12.9209 11.4101 15.6921 4.0182 3.3532 1.2048 10.5523 1.7867 1.6922 42.4409 1.5534 59.1205 6.1472 23.2327 44.4296 23.9348 47.6933 5.8271 8.3250 0.8356 0.2139 21.8767 77.2386 6.4541 1.4264 41.5309 7.0400 11.1661 9.8309 21.0595 2.2225 82.6309 39.6312 0.8140 4.0178 27.8903 3.5886 29.6475 12.8286 0.6411 35.3546 1.9282 18.1084 32.1224 15.6262 31.8574 35.8086 6.8393 36.8791 3.1035 2.9048 0.2424 6.0810 1.6735 4.7310 15.6217 3.5746 3.9592 3.0716 0.1552 1.6895 18.2065 0.4210 26.1003 7.3093 2.1345 0.4691 3.0167 9.7048 24.7685 12.1074 24.7749 40.0817 12.0626 27.4066 6.5712 65.2675 32.9188 13.7680 23.7591 23.2441 14.4670 27.8997 47.2915 290.0015 9.8798 450.9418 8.3061 88.1259 1.0488 8.2712 0.5749 4.9845 3.4174 4.4441 17.5013 28.1526 17.9038 114.7699 18.6461 17.8720 56.7837 92.4116 23.5895 14.6303 31.6327 3.9664 8.3319 137.8120 24.7723 47.4502 40.8176 1.4839 4.4366 45.5279 91.3090 34.6465 4.7920 5.2975 14.2943 19.2100 9.3569 223.3223 6.5982 0.7074 21.3905 1.0128 8.7736 7.9833 51.0662 2.3913 83.6451 65.2128 105.8376 787.6593 14.4036 7.4043 583.3269 183.2543 210.8870 19.1326 240.8819 61.7150 17.4965 7.5307 68.0456 109.6572 138.6749 131.0651 889.8181 4.5309 1223.9725 839.0995 284.3844 33.1638 14.9156 23.1229 17.0012 24.0495 29.0283 37.3137 6.1197 12.3259 29.9159 3.0711 21.2233 20.3695 6.5403 5.3611 23.4685 26.4178 33.2125 39.8205 22.3504 19.0854 31.4287 16.3893 12.7221 33.9639 24.1670 11.1034 2.7356 38.3617 17.9339 12.3244 4.0174 19.4387 8.9394 13.1272 4.2244 0.7875 10.5494 2.1342 1.8163 339.2722 289.0934
temp: 333.150 k
press: 1.00000 atm
elementType: 46 6 8 6 6 6 6 6 1 1 6 8 8 6 1 1 6 6 1 6 1 1 1 6 6 6 6 1 6 1 6 1 1 11 6 1 1 1 6 1 1 1 6 1 1 6 1 1 6 8 6 1 1 1 8 6 6 6 6 1 1 1 1 1 1 1 1 1 7 6 6 1 6 8 8 1 1 6 6 6 6 1 6 1 6 1 1 8 1
symmnumber: 1
zpe: 1888584.3 jmol-1
zpe.correction: 0.719324 hartree
zpe.thermalcorrener: 0.779124 hartree
zpe.thermalcorrenthalpy: 0.780179 hartree
zpe.thermalcorrgfe: 0.620581 hartree
zpe.sumelectzpe: -2338.920270 hartree
zpe.sumelectthermal: -2338.860470 hartree
zpe.sumelectthermalent: -2338.859415 hartree
zpe.sumelectthermalfe: -2339.019013 hartree
dipole: 5.7641 4.0171 -1.6335
dipole: 7.2132
quadrupole: -255.2344 -256.0299 -309.6172
quadrupole: 19.3644 0.7844 -11.0228
quadrupole: 18.3927 17.5973 -35.9900 19.3644 0.7844 -11.0228
hfenergy: -2339.6395941 hartree
pointgroup: C01 [X(C36H42N1Na1O8Pd1)]
dipole: 2.2677748 1.5804422 -0.6426658 debye
polarizability: 768.3308637|94.9170293|639.8629719|30.9408327|-16.0340131|590.849003 unknown
InChI: InChI=1/C22H24O3.C14H18NO5.Na.Pd/c1-5-19(23)12-9-17-14-16(3)8-13-20(17)22(4,21(24)25)18-10-6-15(2)7-11-18;1-14(2,3)20-13(19)15-11(12(17)18)8-9-4-6-10(16)7-5-9;;/h6-11,13-14H,5,12H2,1-4H3;4-7,11,15-16H,8H2,1-3H3;;/q-2;-1;+3;/rC36H42NNaO8Pd/c1-8-24(39)17-18-26-27-20-29-35(7)30(26)47(29,35)46-31(28(37-32(41)42-33(3,4)5)19-22-11-15-25(40)16-12-22)43-38(46)36(44-38,45-38)34(27,6)23-13-9-21(2)10-14-23/h9-16,18,20,28-30,37,40H,8,17,19H2,1-7H3
charge 0 multiplicity 1
89 atoms
Pd 0.30147599 0.96210083 -0.07550399
C  4.14211193 -0.82531851 -0.96550831
O  4.1809098 -0.34265844 -2.09020567
C  -0.76411476 2.43863891 -1.25465951
C  -2.02777778 2.18535984 -0.57580142
C  -1.9819672 -0.1558613 -1.23703395
C  -0.6612882 0.16598929 -1.83226409
C  -0.18694066 1.46883267 -2.10458106
H  -0.38640911 3.46389933 -1.27334259
H  -0.15260687 -0.66653817 -2.3286901
C  -3.06842988 -0.09640603 1.61048042
O  -2.15237684 0.48392041 2.25340827
O  -3.37366104 -1.30422389 1.76839039
C  -2.33308336 -1.46137302 -1.43149188
H  -1.60371051 -2.01137004 -2.03819625
H  2.15659262 -0.63239188 -0.73216994
C  -2.63702881 0.96602434 -0.50592519
C  -3.76847617 0.76784673 0.50515705
H  -2.43993955 3.0321803 -0.02818046
C  -4.20008377 2.08200706 1.1823723
H  -3.37169165 2.55545943 1.72439764
H  -4.60414185 2.7887767 0.44132922
H  -4.99705071 1.86164377 1.90804828
C  -5.0435225 0.18909719 -0.09093557
C  -6.02114475 -0.38987824 0.73682255
C  -5.34117991 0.33402231 -1.44864495
C  -7.23057804 -0.83837636 0.21275956
H  -5.82075326 -0.49923602 1.80542629
C  -6.55767489 -0.11810639 -1.97371349
H  -4.60801611 0.79052208 -2.12031456
C  -7.52122687 -0.71862783 -1.15764773
H  -7.96945301 -1.29502001 0.878471
H  -6.75464468 -0.00653573 -3.04447557
Na -1.11452888 -1.58088116 2.45100196
C  0.96096007 1.75767128 -3.02340632
H  0.59328321 1.95571045 -4.04283207
H  1.5146289 2.64651591 -2.68486319
H  1.65352644 0.90433444 -3.07267826
C  -8.8098716 -1.25348019 -1.71866032
H  -8.83940373 -2.35419058 -1.65676435
H  -9.67956011 -0.87983019 -1.15612194
H  -8.93628653 -0.9732782 -2.77432193
C  -3.49513466 -2.32172647 -1.07189851
H  -4.1175802 -1.94147414 -0.25559071
H  -3.11503295 -3.29670819 -0.71565578
C  -5.53319921 -3.55585573 -2.02239875
H  -5.10395069 -4.5253209 -1.71307965
H  -6.06700762 -3.18141185 -1.1318255
C  -4.37198858 -2.62572431 -2.27094373
O  -4.14627301 -2.15305844 -3.37185151
C  -6.44958092 -3.70390574 -3.22192397
H  -6.86939707 -2.72989941 -3.51826873
H  -5.90230498 -4.10257716 -4.08893423
H  -7.28382612 -4.38532978 -3.00120401
O  5.20387426 -1.24406645 -0.27081258
C  6.56691309 -1.12470256 -0.76884968
C  6.93108212 0.34577273 -0.92353136
C  6.72636429 -1.9035239 -2.06836833
C  7.39619431 -1.76421947 0.33469464
H  7.980047 0.43075018 -1.24428075
H  6.29660044 0.83754587 -1.67281128
H  6.82638721 0.86871843 0.04028407
H  6.18611771 -1.42682889 -2.89547829
H  7.79408249 -1.95775728 -2.32828755
H  6.35186827 -2.93102135 -1.94157572
H  7.23997672 -1.23720286 1.28834058
H  7.11509965 -2.81992302 0.46587453
H  8.46446108 -1.71473184 0.0791228
N  2.98612454 -1.02311599 -0.27842291
C  2.89310843 -1.2349473 1.15162713
C  1.43689736 -1.44742167 1.55426759
H  3.43815768 -2.14632003 1.43799396
C  3.45942796 -0.05074183 1.97778778
O  0.51640482 -1.03848871 0.7625669
O  1.1972383 -1.97489825 2.65373298
H  3.22313744 -0.2404506 3.03639277
H  4.55346508 -0.04865088 1.86953077
C  2.89517038 1.26214369 1.51329365
C  1.5794434 1.64909232 1.87172048
C  3.60360161 2.08610594 0.63996907
C  1.00768942 2.82358476 1.35645946
H  1.03078984 1.07720581 2.62816505
C  3.05822944 3.27844139 0.13925637
H  4.61717275 1.79864548 0.34275716
C  1.76640317 3.65402817 0.49462055
H  0.03024968 3.17249075 1.70065532
H  3.63937375 3.92087553 -0.52816821
O  1.18245697 4.79204177 0.06290124
H  1.78640594 5.29202512 -0.51174641
