program: Gaussian 16
title: (SMD = 2-propanol)-MN15/BS1
version: ES64L-G16RevC.01
method: RMN15
basis: GenECP
operation: Freq
keyword: #N
keyword: Geom=AllCheck
keyword: Guess=TCheck
keyword: SCRF=Check
keyword: GenChk
keyword: RMN15/GenECP
keyword: Freq
converged: YES YES NO NO
title: Mulliken charges:
elementType: Pd C O C C C C C H H C O O C H H C C H C H H H C C C C H C H C H H Na C H H H C H H H C H H C H H C O C H H H O C C C C H H H H H H H H H N C C H C O O H H C C C C H C H C H H O H
charge: -0.060283 0.309879 -0.300659 -0.023015 -0.087180 0.097041 -0.104365 -0.048290 -0.019461 -0.028994 0.247913 -0.388470 -0.304084 -0.156364 0.039591 0.319331 0.096528 -0.247791 -0.015016 0.191148 0.006881 0.008702 0.015664 0.039270 -0.007917 -0.013266 -0.039600 0.001340 -0.030032 -0.011056 -0.070570 -0.013528 -0.014116 0.545367 0.097193 0.041951 0.021154 0.024743 0.079171 0.044482 0.031456 0.022901 0.124536 0.034346 0.039616 0.064436 0.022782 0.032501 -0.035926 -0.228289 -0.032947 0.046505 0.027744 0.037368 -0.275307 -0.195713 0.078465 0.100097 0.089683 0.023815 0.028414 0.031502 0.027082 0.034327 0.032309 0.028948 0.031425 0.018227 -0.282419 0.023373 0.198910 0.051483 0.187049 -0.391980 -0.298604 0.024791 0.004169 -0.086271 -0.004235 0.056992 -0.107152 0.013337 0.025839 -0.043556 0.144712 0.031676 -0.050251 -0.209784 0.228328
chargesum: -0.00000
title: Mulliken charges with hydrogens summed into heavy atoms:
elementType: Pd C O C C C C C C O O C C C C C C C C C C Na C C C C C O C O C C C C N C C C O O C C C C C C O
charge: -0.060283 0.309879 0.018672 -0.042477 -0.102196 0.097041 -0.133359 -0.048290 0.247913 -0.388470 -0.304084 -0.116773 0.096528 -0.247791 0.222395 0.039270 -0.006577 -0.024322 -0.053128 -0.044148 -0.070570 0.545367 0.185042 0.178010 0.198498 0.119718 -0.035926 -0.228289 0.078670 -0.275307 -0.195713 0.162196 0.193814 0.168283 -0.282419 0.074856 0.198910 0.216009 -0.391980 -0.298604 -0.086271 0.009102 0.013436 -0.075476 -0.024412 0.144712 0.018543
chargesum: 0.00000
1716.lowfreq: -1565.3579 -10.9415 -6.2472 -0.0005 0.0005 0.0008 6.7311 9.6412 26.0762
frequency: -1565.3578 -10.6866 26.0469 31.7351 35.9736 37.9354 42.0529 44.4337 49.8428 54.3222 60.9988 63.4342 68.4156 71.9145 74.5612 79.7140 82.1284 86.5495 91.9807 97.3979 100.6229 110.1642 118.6523 120.6264 139.5932 146.4344 152.0330 162.9984 169.2834 174.8083 177.3957 183.6481 191.2141 203.8268 218.2233 220.6592 222.8319 229.8178 233.3674 244.4033 246.5860 252.2371 269.1890 275.6164 278.2680 281.4009 294.9758 299.6627 317.7138 326.7938 332.1740 340.9918 346.6684 351.4492 354.1610 357.7432 364.7047 380.4721 384.9421 398.4558 402.7012 415.1532 423.7961 424.8370 428.6963 434.0007 437.9270 440.2754 447.2083 453.7033 458.0346 472.8799 488.2766 514.0083 515.2286 539.8223 542.8772 558.1418 577.6072 581.7664 586.4077 610.7200 619.1335 632.6349 633.7550 636.9077 667.7515 711.7709 726.0427 736.3482 744.8042 748.5513 748.9604 753.2948 760.7373 769.6665 787.7738 793.0891 810.2015 819.5000 831.6812 842.9069 848.0605 856.6254 861.2375 864.7655 867.0454 878.7529 886.9139 890.9703 895.6569 913.5119 921.6993 922.4877 925.7534 926.2335 941.2008 952.8171 953.4221 964.4065 982.8378 988.6103 990.4487 998.6774 1003.6895 1005.1744 1011.9579 1013.0953 1015.0933 1016.2919 1021.3055 1026.1667 1032.0301 1039.6597 1043.8892 1053.0564 1058.5015 1071.4340 1079.9512 1092.9912 1097.4566 1115.7141 1125.9512 1130.5152 1144.4354 1152.4246 1159.9204 1164.2856 1166.5400 1171.7853 1173.7075 1178.8371 1183.9604 1214.1943 1221.9928 1223.9924 1228.9960 1232.7958 1240.5690 1243.4661 1256.3770 1260.8638 1268.6322 1275.5102 1293.1852 1297.1495 1298.0147 1301.2332 1308.4901 1317.7312 1324.0932 1343.0384 1349.0033 1356.5827 1359.8186 1364.5067 1364.8962 1366.8697 1369.2044 1372.0509 1373.5736 1373.6858 1380.6367 1381.3548 1402.1847 1403.9111 1410.5376 1410.8485 1412.1670 1413.5304 1415.6247 1417.7309 1419.1005 1419.6676 1421.0391 1424.9383 1428.8980 1432.1239 1433.2242 1439.3552 1442.6019 1446.3741 1449.9895 1452.6543 1465.9674 1472.2071 1531.6569 1549.2278 1560.5982 1582.5059 1638.4493 1648.5277 1662.6739 1680.8931 1685.9110 1694.4800 1698.2613 1701.0501 1790.4465 1814.1496 3058.3212 3069.8289 3071.8352 3072.9840 3075.8314 3077.8566 3080.2929 3084.2043 3097.3727 3097.5597 3127.4514 3135.3424 3152.8038 3155.5289 3163.2190 3163.2411 3163.6778 3173.8053 3176.0786 3177.5084 3177.7979 3178.0656 3180.5320 3181.0924 3181.9112 3182.3469 3190.6529 3194.6063 3194.9362 3205.8888 3206.6455 3210.9025 3212.6114 3213.2627 3213.6850 3220.8223 3224.5540 3229.4353 3253.7883 3265.5251 3836.3334
redmass: 1.0845 1.0205 4.3435 4.1660 4.1676 1.2383 3.5936 5.1356 3.9519 4.3634 4.5126 5.0624 4.1966 5.0342 6.0011 3.8344 5.4122 3.6946 7.3705 5.4293 5.6245 4.5231 5.9277 5.7108 7.6848 5.0120 4.6225 7.5663 7.1229 4.8837 2.9136 5.1278 8.1791 4.6585 2.6674 1.7569 5.6613 2.8868 1.7518 5.6339 3.6820 4.8408 1.6504 2.1246 1.9343 4.0421 1.1236 2.7752 6.7970 2.7898 2.2122 3.8728 2.2656 3.0532 3.1286 2.0975 3.0139 4.5033 4.0221 5.8935 3.7695 3.4195 2.7876 2.9302 1.7045 3.1586 2.5904 3.9002 2.6776 3.0734 3.2032 6.3308 4.0969 3.8395 4.0346 3.2470 2.3483 4.4296 4.3648 3.0151 3.7035 3.6995 4.4006 3.9272 6.6040 6.1848 5.3149 5.4038 5.2693 4.1968 4.1509 2.6854 3.8993 4.6499 4.5892 6.6147 1.7525 1.9144 4.4229 4.9174 3.6302 1.5120 1.5430 1.6850 2.6159 1.2578 2.7764 2.2314 1.9287 2.7737 2.7198 2.5707 1.4924 1.5516 2.2070 1.5688 1.2093 2.0031 2.7853 1.6991 1.3842 1.3744 1.4336 1.3905 2.1829 1.9196 1.9919 2.8020 1.4638 1.3840 1.4241 1.4299 1.7055 1.6267 1.6375 2.0426 2.0989 2.1617 2.3598 1.2524 1.7362 1.2777 2.0050 1.7482 2.1357 1.0935 1.4580 1.5041 1.4690 1.3706 1.1062 2.7356 1.4517 2.1758 1.6796 2.1833 1.6796 1.6679 1.8616 1.3400 2.8239 2.0974 2.0558 1.9251 1.7527 1.5644 1.6436 1.3198 1.4224 1.8464 2.8784 2.0333 5.5759 3.9125 1.3094 1.3175 1.3066 1.3220 1.4060 1.4927 1.3719 1.4004 2.1065 4.8308 5.3472 1.0630 1.1318 1.2240 1.5106 1.2049 1.0566 1.1135 1.9847 1.0591 1.1257 1.1812 1.1616 1.0503 1.1215 1.1393 1.1211 1.1641 2.4455 2.6301 3.4025 1.3213 3.6431 3.2472 3.8127 4.4008 7.1544 7.3035 7.0740 9.1794 7.4015 8.2344 7.6976 9.3653 12.5859 11.4681 1.0693 1.0391 1.0395 1.0374 1.0368 1.0373 1.0365 1.0389 1.0616 1.0621 1.0863 1.0930 1.1030 1.1017 1.1058 1.1022 1.0884 1.1048 1.1047 1.1056 1.1050 1.1052 1.1051 1.1045 1.1046 1.1053 1.1049 1.0899 1.1047 1.0912 1.0911 1.0885 1.0957 1.1033 1.0890 1.0920 1.0962 1.0965 1.0936 1.0921 1.0664
irintensity: 4252.7685 0.8584 0.6341 0.4259 2.6235 1.3239 2.1846 3.5096 4.4232 2.7795 3.8893 0.4669 1.7976 3.6550 4.6061 6.7562 9.3530 6.8450 15.1315 11.6115 1.4800 2.6358 6.2637 4.6269 3.6492 1.3611 0.3205 11.8436 4.6060 6.9582 4.5038 0.6027 16.5184 5.7670 11.9088 4.3668 4.9819 1.6904 0.9562 28.6169 2.4707 12.3399 0.2077 13.8639 6.4437 6.1666 0.2599 5.7819 50.3514 18.5403 93.5049 5.7544 14.6445 18.9141 17.2586 79.8884 0.3680 33.6040 26.7053 25.9979 28.2495 10.0864 2.1602 13.4566 30.9515 6.8157 46.7168 9.6135 4.7383 21.3449 3.0084 1.5641 16.3621 21.6050 10.0851 3.6972 1.2291 14.6697 28.7577 36.5834 8.3853 23.7540 25.3237 11.1250 0.7484 0.5512 35.9451 70.6810 13.2004 2.0494 9.4463 20.2855 15.9745 30.3323 4.4026 48.4022 10.4305 18.7875 2.6553 3.4010 32.3418 21.5469 39.2007 11.1162 15.1685 0.8215 15.1512 16.8615 50.7834 97.8197 16.4054 21.0407 4.8161 14.5880 40.7573 2.7187 0.1306 16.2577 0.5501 22.2628 3.7013 4.9431 1.3955 4.4612 12.5953 6.1519 6.4523 18.2626 2.4060 0.2126 0.6436 1.1612 15.6521 14.6033 13.4085 4.4168 17.2964 5.4350 16.0945 34.6495 2.6408 15.4525 50.5093 3.8894 33.3867 6.4830 210.2495 45.8901 67.9182 6.1444 19.2529 463.7113 26.2589 47.7194 15.3848 24.4983 24.6313 58.8395 1.3739 30.4649 16.5662 27.3712 31.7003 8.0613 14.4642 10.3760 19.5334 5.3505 8.5520 25.3520 131.1283 6.7497 16.0301 4.1049 0.4462 13.4606 89.4461 6.8302 44.2128 26.8461 41.2118 1.2978 166.6781 27.1085 1371.2512 27.5022 2.9466 8.8037 35.5576 34.2446 2.6160 9.1948 128.6747 10.7865 38.8168 19.5898 11.6694 16.6082 4.1230 40.1187 16.7869 29.7672 41.8285 7.2140 6.2843 225.3515 60.1693 72.2547 300.3818 439.5466 23.1975 3.1955 19.5362 1616.0059 66.7345 44.0510 29.1900 397.8353 1217.8802 348.8755 19.9644 33.0402 33.4379 17.0008 30.2707 16.3480 21.9559 15.2898 18.7007 23.5079 30.9247 10.5374 13.2703 17.4724 9.0892 4.8918 8.2470 19.6608 11.9237 32.7116 29.5609 30.4413 44.3796 16.8140 26.3664 21.1930 28.5527 8.5828 25.9067 11.9607 1.0689 15.7963 3.3148 12.6161 12.2588 17.2925 19.0547 9.4594 9.8022 6.8491 252.4930
temp: 333.150 k
press: 1.00000 atm
elementType: 46 6 8 6 6 6 6 6 1 1 6 8 8 6 1 1 6 6 1 6 1 1 1 6 6 6 6 1 6 1 6 1 1 11 6 1 1 1 6 1 1 1 6 1 1 6 1 1 6 8 6 1 1 1 8 6 6 6 6 1 1 1 1 1 1 1 1 1 7 6 6 1 6 8 8 1 1 6 6 6 6 1 6 1 6 1 1 8 1
symmnumber: 1
zpe: 1877849.6 jmol-1
zpe.correction: 0.715235 hartree
zpe.thermalcorrener: 0.772900 hartree
zpe.thermalcorrenthalpy: 0.773955 hartree
zpe.thermalcorrgfe: 0.620245 hartree
zpe.sumelectzpe: -2338.912288 hartree
zpe.sumelectthermal: -2338.854624 hartree
zpe.sumelectthermalent: -2338.853569 hartree
zpe.sumelectthermalfe: -2339.007278 hartree
dipole: 0.9648 2.0393 6.7951
dipole: 7.1598
quadrupole: -271.8260 -242.4105 -304.2557
quadrupole: 10.6492 22.6747 12.7047
quadrupole: 1.0048 30.4202 -31.4250 10.6492 22.6747 12.7047
hfenergy: -2339.6275235 hartree
pointgroup: C01 [X(C36H42N1Na1O8Pd1)]
dipole: 0.3795948 0.8023267 2.6733969 debye
polarizability: 631.4265801|22.4497514|644.8892845|-15.7016794|35.6303823|653.5332298 unknown
InChI: InChI=1/C36H42NO8.Na.Pd/c1-8-26(38)21-31(28-19-23(3)11-18-29(28)36(7,33(42)43)25-14-9-22(2)10-15-25)46-45-34(44-35(4,5)6)37-30(32(40)41)20-24-12-16-27(39)17-13-24;;/h9-19,30-31,39H,8,20-21H2,1-7H3;;/q-2;2*+1/rC36H42NNaO8Pd/c1-8-26(39)21-36-29-19-23(3)11-18-28(29)35(7,25-14-9-22(2)10-15-25)32-43-38-45-31(41)30(20-24-12-16-27(40)17-13-24)37(47(36,45)46(32)38)33(44-48-36)42-34(4,5)6/h9-19,30,36,40H,8,20-21H2,1-7H3
charge 0 multiplicity 1
89 atoms
Pd 0.27827862 -0.27731549 -1.18039285
C  2.52170732 1.29104104 -0.3817299
O  1.65546275 1.91770852 0.30710136
C  -1.23142151 -0.80674887 4.08941
C  -2.02467478 -1.26326508 3.03413584
C  -1.03651454 0.34655775 1.52846109
C  -0.24671034 0.78315055 2.60469822
C  -0.32142104 0.23380308 3.89022852
H  -1.32522407 -1.271082 5.07506724
H  0.46318726 1.59822916 2.4327223
C  -2.12759869 -1.9696477 -0.43965747
O  -1.49946969 -1.29213144 -1.34349707
O  -2.1299066 -3.20867429 -0.4686252
C  -0.84977047 1.03764372 0.20266813
H  -1.62335948 0.72615856 -0.50764508
H  0.54781475 1.28388512 0.07670402
C  -1.95875574 -0.71421056 1.74525585
C  -2.92761589 -1.22523762 0.65539829
H  -2.7192195 -2.07622676 3.24330651
C  -3.94396416 -2.22974214 1.22029549
H  -4.55209585 -1.75786572 2.00595939
H  -4.61522378 -2.55416052 0.41175006
H  -3.44663963 -3.1204457 1.62636487
C  -3.75927762 -0.08074722 0.06327101
C  -4.25151228 -0.13583134 -1.24943451
C  -4.1741512 0.98599353 0.87040776
C  -5.09241916 0.86054803 -1.74457456
H  -3.97577044 -0.96855833 -1.90215706
C  -5.02012025 1.98088404 0.37309007
H  -3.83218137 1.04380552 1.90793787
C  -5.48712368 1.94513123 -0.94686268
H  -5.45415285 0.79296927 -2.77491839
H  -5.3255559 2.80261798 1.02778481
Na -0.37666913 -3.25671353 -2.05465772
C  0.54580266 0.76071369 4.99974137
H  0.22089809 1.76621656 5.31242759
H  0.51148927 0.10750186 5.88300791
H  1.59469102 0.85004821 4.67623009
C  -6.36842411 3.03182267 -1.49823472
H  -5.78934185 3.72995374 -2.12475054
H  -7.16652078 2.6183452 -2.13282212
H  -6.83379222 3.61871958 -0.69348902
C  -1.01480253 2.56255326 0.26463135
H  -0.43589074 3.03764483 1.07275565
H  -2.07343128 2.80722758 0.47685361
C  -0.57925572 4.76066678 -0.99197252
H  -0.72696823 5.12863797 -2.0176493
H  -1.38274537 5.15969992 -0.35286553
C  -0.67337582 3.25571105 -1.02901467
O  -0.4659403 2.6317688 -2.05862778
C  0.78319547 5.2042028 -0.45638269
H  0.92142724 4.89925358 0.59187722
H  1.60031277 4.7669023 -1.0503155
H  0.87621113 6.29881465 -0.50197963
O  3.81093041 1.57201404 -0.32553019
C  4.44511939 2.28935104 0.78269469
C  5.92240211 2.20784204 0.43264586
C  4.16016176 1.55440843 2.0852292
C  3.98143073 3.73759521 0.81885286
H  6.24111473 1.157404 0.35302966
H  6.11881324 2.71035542 -0.52613954
H  6.51969192 2.69764976 1.21477468
H  3.08596194 1.55309851 2.32326247
H  4.51899579 0.51473719 2.02739192
H  4.69247281 2.05530862 2.90716198
H  4.6313307 4.30366508 1.50279391
H  4.06180347 4.18822848 -0.18223689
H  2.94645925 3.82330334 1.17114469
N  2.14576076 0.32811116 -1.19687818
C  3.07886411 -0.6001029 -1.81429728
C  2.31031237 -1.5096717 -2.76628159
H  3.85865592 -0.0673099 -2.38066769
C  3.75962578 -1.53241703 -0.77696148
O  1.01572818 -1.53679716 -2.59026009
O  2.89339003 -2.22555509 -3.56721099
H  4.44082383 -2.19620342 -1.33109623
H  4.36528627 -0.90778881 -0.10239131
C  2.74128661 -2.32430319 0.00059183
C  2.246355 -3.54921758 -0.47071509
C  2.1597876 -1.79104993 1.16107743
C  1.18348707 -4.19969609 0.16693321
H  2.69166551 -3.99876907 -1.36476365
C  1.10824928 -2.4307511 1.8120135
H  2.52991831 -0.83980746 1.55903939
C  0.595339 -3.63155744 1.30733829
H  0.82048617 -5.16875179 -0.19475579
H  0.65862039 -2.00332635 2.70983149
O  -0.4416798 -4.20385247 1.957983
H  -0.77018638 -4.97502466 1.46728692
