program: Gaussian 16
title: SMD(2-propanol)-MN15/BS1
version: ES64L-G16RevC.01
method: RMN15
basis: GenECP
operation: Freq
keyword: #N
keyword: Geom=AllCheck
keyword: Guess=TCheck
keyword: SCRF=Check
keyword: GenChk
keyword: RMN15/GenECP
keyword: Freq
converged: YES YES YES YES
title: Mulliken charges:
elementType: Pd C O C C C C C H H C O O C H H C C H C H H H C C C C H C H C H H Na C H H H C H H H C H H C H H C O C H H H O C C C C H H H H H H H H H N C C H C O O H H C C C C H C H C H H O H
charge: -0.074962 0.304851 -0.289964 -0.015861 -0.051344 0.085854 -0.068471 -0.063758 -0.016584 -0.037797 0.237981 -0.373947 -0.309356 -0.172838 0.007412 0.311550 0.031979 -0.168684 -0.001620 0.150486 0.015849 0.061410 0.026675 -0.003611 -0.003349 -0.028674 -0.043721 -0.008734 -0.036448 -0.010884 -0.066701 -0.015749 -0.013905 0.523483 0.098207 0.028550 0.015508 0.045009 0.080015 0.040850 0.034449 0.020718 0.117640 0.036870 0.052423 0.066542 0.023352 0.033078 -0.037281 -0.228809 -0.032583 0.037980 0.046795 0.026806 -0.274699 -0.196408 0.096360 0.095211 0.081072 0.035075 0.027891 0.027145 0.030838 0.016252 0.029397 0.024204 0.028980 0.031928 -0.278993 0.018164 0.210776 0.055088 0.190113 -0.389166 -0.292827 0.024737 0.011022 -0.092207 0.000587 0.089723 -0.087008 0.006782 0.029481 -0.030303 0.117004 0.019778 -0.046920 -0.221072 0.225306
chargesum: -0.00000
title: Mulliken charges with hydrogens summed into heavy atoms:
elementType: Pd C O C C C C C C O O C C C C C C C C C C Na C C C C C O C O C C C C N C C C O O C C C C C C O
charge: -0.074962 0.304851 0.021586 -0.032445 -0.052965 0.085854 -0.106268 -0.063758 0.237981 -0.373947 -0.309356 -0.165427 0.031979 -0.168684 0.254419 -0.003611 -0.012083 -0.039558 -0.059470 -0.050353 -0.066701 0.523483 0.187275 0.176033 0.206934 0.122972 -0.037281 -0.228809 0.078999 -0.274699 -0.196408 0.186471 0.171699 0.166184 -0.278993 0.073252 0.210776 0.225873 -0.389166 -0.292827 -0.092207 0.007369 0.059419 -0.067229 -0.017440 0.117004 0.004235
1716.lowfreq: -1548.2006 -5.3006 -0.0003 0.0008 0.0011 3.2607 5.1839 21.3696 29.5369
frequency: -1548.2005 21.1404 29.4665 34.2053 38.2551 41.9060 48.9256 50.3800 53.6033 57.6400 59.0175 62.3282 69.3712 72.4097 73.7090 82.9090 85.8983 88.8353 94.4783 101.5352 107.9289 113.5109 117.8263 130.5765 139.7385 147.8082 154.3347 161.2854 165.9332 170.7412 174.5269 185.0443 186.5433 195.9020 202.6515 214.1570 219.2384 221.7751 235.6175 241.6947 243.8522 257.7426 262.5327 271.6279 275.4683 281.4498 286.3070 291.3336 293.9765 305.0208 311.8515 330.0944 339.7056 350.7546 354.0603 362.7035 372.8508 379.8353 385.3387 391.6625 396.6201 412.0483 416.5831 421.6368 421.9219 434.3080 438.8291 444.8229 447.7080 455.8258 461.2831 473.4280 480.0365 504.6768 512.1076 548.5774 554.6642 560.6405 577.6834 582.3453 595.3725 609.2785 620.7543 634.0699 635.9110 637.4622 664.3314 711.7321 719.7333 737.6166 744.9058 749.2494 750.3700 758.0075 761.8079 773.3159 785.9703 794.0525 812.1567 820.4988 831.3912 844.8275 854.6522 855.1509 860.0489 866.0101 869.1147 875.9589 886.2105 890.8004 895.3879 911.0185 916.5927 920.6967 921.7070 925.3621 940.3744 950.5273 954.2070 965.2870 980.9026 988.6732 992.5781 999.3638 1003.3960 1006.7520 1008.6747 1011.7091 1013.5116 1020.8282 1021.3539 1026.4273 1030.0219 1036.7380 1041.0886 1045.0744 1057.3047 1067.9596 1077.0840 1082.4547 1091.6448 1115.9477 1122.9292 1129.2052 1141.6522 1150.3279 1157.3357 1164.7665 1171.4428 1174.1871 1175.5297 1184.0061 1191.4559 1211.8767 1213.8680 1221.6833 1233.6487 1235.6458 1241.2691 1247.0789 1256.1250 1260.8994 1269.1469 1275.8887 1287.8220 1297.0909 1300.3891 1301.9915 1306.7651 1312.7389 1327.0552 1340.0038 1350.4982 1355.4018 1357.4852 1365.9608 1367.3713 1368.7639 1370.1638 1373.7159 1373.9012 1374.4790 1379.5475 1382.7379 1397.2607 1403.2952 1405.1643 1409.4688 1411.0109 1413.7355 1415.0753 1416.3049 1417.8161 1419.4520 1420.9110 1423.4988 1430.4362 1433.4654 1434.1043 1442.4088 1446.2678 1448.3098 1453.8282 1460.0000 1461.8735 1475.9167 1530.3984 1550.0919 1556.3510 1584.7220 1633.4579 1650.0110 1658.1262 1680.4531 1684.8059 1693.6907 1697.6719 1699.3507 1795.3927 1813.3097 3055.8163 3070.0611 3071.8500 3074.6283 3076.4926 3078.0591 3083.7055 3085.4103 3097.9822 3108.0688 3129.4169 3131.3046 3154.9450 3155.2857 3164.1790 3171.0783 3174.6028 3175.5010 3177.1274 3177.4968 3178.6482 3178.7293 3181.2254 3181.6287 3183.0137 3191.3789 3198.8680 3205.1205 3205.4971 3208.0789 3214.9418 3215.7781 3219.2045 3222.1731 3222.7603 3225.8308 3237.6856 3243.2731 3245.0921 3262.4019 3816.1201
redmass: 1.0877 4.3402 4.5394 4.9274 3.3507 4.5243 1.5020 4.9352 3.7108 1.0552 3.3359 2.9047 4.7980 5.9932 4.5823 3.1395 5.1281 6.3673 3.8445 4.1605 5.7760 5.8697 6.1758 6.9039 2.4677 5.5601 5.6484 4.8367 3.9044 2.8366 3.0947 5.4573 5.1219 6.7121 5.1617 4.8532 1.5065 4.7942 3.5444 1.5888 5.0651 3.9010 2.1155 1.8351 2.4500 3.4140 2.3521 1.4948 2.2127 2.7607 8.6380 3.1092 4.6631 2.6576 2.9846 3.0065 2.0033 3.7563 3.9937 4.7763 1.9627 4.4203 3.1634 3.2129 2.9163 3.7409 3.3213 3.7896 2.7724 3.0738 3.8618 5.8874 4.4106 3.5027 4.2565 2.4588 4.3285 3.1014 4.0338 2.8373 3.9379 3.9109 4.4984 6.4893 5.9306 4.0304 5.0799 5.3855 4.6757 4.1427 4.3043 3.5515 3.4870 4.2932 4.7449 6.9818 2.3777 1.4705 4.2565 4.8519 3.8285 1.4748 1.5644 1.2737 5.2027 2.7568 1.2635 2.3335 2.0107 2.7342 2.6803 2.5818 1.9486 1.6538 1.4845 1.5308 1.2055 2.9430 1.9819 1.7037 1.3965 1.4786 1.3810 1.4136 1.8975 1.6754 1.7885 1.7595 2.6174 1.4041 1.4265 1.4280 1.6796 1.8102 1.7876 1.6341 1.9550 2.1215 2.0803 2.1238 1.2408 1.3212 1.9482 1.5853 3.0223 1.0988 1.3490 1.7523 1.6702 1.1235 2.4209 1.2933 1.8827 1.7497 2.1747 2.1653 1.5855 1.3202 1.9820 1.3834 3.0612 2.1085 2.0693 1.6406 1.9622 2.0995 1.3168 1.2850 1.3924 1.7331 2.5632 2.1517 4.0576 1.4166 4.7950 1.4783 1.2017 1.3092 1.3761 1.4666 1.4095 1.3628 4.2836 1.8872 4.1415 1.0841 1.3764 1.8572 1.0630 1.1925 1.3209 1.1012 1.0660 1.0656 1.0884 1.5911 1.1609 1.1232 1.0493 1.1136 2.2341 1.1729 2.5234 1.5129 2.1651 1.1667 3.5565 3.2967 3.7948 4.1669 7.5809 7.2187 6.8868 9.3809 7.3038 7.8700 9.0237 8.3555 12.6244 11.4802 1.0692 1.0391 1.0391 1.0375 1.0368 1.0374 1.0397 1.0390 1.0615 1.0620 1.0863 1.0943 1.1026 1.1021 1.1060 1.1061 1.1039 1.1046 1.1049 1.1055 1.1055 1.1052 1.1050 1.1051 1.1044 1.1050 1.1030 1.0907 1.0908 1.0883 1.1027 1.0918 1.0910 1.0899 1.0969 1.0948 1.0966 1.0803 1.0935 1.0931 1.0658
irintensity: 4255.7946 0.6079 0.6211 0.5058 0.3122 0.8372 0.1215 0.3222 5.7486 0.6983 0.6688 1.0020 8.2385 8.7745 0.8607 2.7951 3.1035 3.5717 0.4438 8.9623 6.6654 1.4165 10.3294 8.6732 2.7271 2.5070 11.7371 10.9861 5.1879 3.4536 1.4677 1.7583 2.3180 23.6062 3.8711 7.8422 1.1616 6.3829 1.8376 2.9767 14.2672 15.7672 2.1294 9.9361 1.1369 8.4991 3.4882 6.3805 7.3442 4.3240 20.2909 13.4033 79.4175 11.1546 3.1589 10.2708 102.5102 10.9729 11.8289 64.5361 104.0359 18.2525 7.5307 5.1719 1.0374 13.5956 46.8242 50.3664 4.7142 20.0136 12.0632 1.6649 3.1592 18.1166 4.2393 5.0409 10.4290 23.4718 15.8485 34.7640 10.7819 19.6812 19.8067 0.2516 0.7391 8.5969 39.3683 44.8865 61.8941 4.1420 14.5129 37.4853 14.2801 5.6407 13.2745 47.3984 10.5751 7.3083 5.6707 0.5287 27.2912 36.6227 20.7801 0.5914 23.3423 11.4292 1.3919 10.4428 47.3803 108.7133 57.5182 19.2355 22.9679 8.2758 1.3109 3.5326 0.1456 4.2514 18.7778 17.4688 3.3316 2.9672 4.4441 7.9890 8.8302 11.2962 14.3153 0.1673 32.1233 0.5477 0.7999 1.6527 19.9332 10.5584 10.2149 11.3557 19.7234 30.1509 9.6017 6.7699 16.3296 17.3410 45.1169 17.9972 25.0012 14.7469 34.2502 9.3659 55.9888 56.7478 421.7235 276.8207 16.2874 6.6437 43.8626 19.6787 55.1207 26.5642 6.3415 42.9586 66.7564 28.3127 30.0658 7.0857 6.1498 23.2856 15.8944 2.3006 104.1182 26.0425 55.0531 18.6238 33.2154 23.6985 11.8139 40.2450 50.3646 13.9818 44.9602 27.7182 1.5337 36.5273 6.5108 167.0069 1354.6541 4.9664 28.3084 64.3429 4.5687 57.8188 8.1693 23.7542 12.5337 12.9497 4.2447 155.5673 13.1883 9.4732 10.7869 15.5249 27.9469 35.0112 17.5431 144.3474 23.6295 91.3459 49.9574 65.8909 297.7248 433.9626 15.2404 5.8079 39.3080 1430.5323 78.2842 81.3405 299.6860 114.9397 1144.8101 360.0052 24.2184 32.0927 35.6561 16.4738 30.0541 14.1543 20.0762 15.2154 17.8044 17.8020 28.2772 10.0064 16.6010 14.6978 0.9962 22.8814 27.0279 8.6873 11.5408 31.0273 18.6158 31.9907 22.1708 43.7133 18.4755 27.4243 15.6626 14.7651 2.3893 15.8951 12.6239 24.9794 13.7047 5.5554 15.0052 9.5807 2.3202 32.5843 6.3948 4.6287 256.5127
temp: 333.150 k
press: 1.00000 atm
elementType: 46 6 8 6 6 6 6 6 1 1 6 8 8 6 1 1 6 6 1 6 1 1 1 6 6 6 6 1 6 1 6 1 1 11 6 1 1 1 6 1 1 1 6 1 1 6 1 1 6 8 6 1 1 1 8 6 6 6 6 1 1 1 1 1 1 1 1 1 7 6 6 1 6 8 8 1 1 6 6 6 6 1 6 1 6 1 1 8 1
symmnumber: 1
zpe: 1877897.4 jmol-1
zpe.correction: 0.715253 hartree
zpe.thermalcorrener: 0.774034 hartree
zpe.thermalcorrenthalpy: 0.775089 hartree
zpe.thermalcorrgfe: 0.618204 hartree
zpe.sumelectzpe: -2338.898660 hartree
zpe.sumelectthermal: -2338.839880 hartree
zpe.sumelectthermalent: -2338.838825 hartree
zpe.sumelectthermalfe: -2338.995710 hartree
dipole: -1.4471 -5.3725 9.4294
dipole: 10.9486
quadrupole: -254.8676 -274.3924 -305.9759
quadrupole: 15.0932 -21.9746 -1.1998
quadrupole: 23.5444 4.0195 -27.5639 15.0932 -21.9746 -1.1998
hfenergy: -2339.6139138 hartree
pointgroup: C01 [X(C36H42N1Na1O8Pd1)]
dipole: -0.5693209 -2.1136962 3.7098102 debye
polarizability: 740.1369978|28.1124082|616.9961357|35.8401726|-69.2109325|574.4491398 unknown
InChI: InChI=1/C36H42NO8.Na.Pd/c1-8-26(38)21-31(28-19-23(3)11-18-29(28)36(7,33(42)43)25-14-9-22(2)10-15-25)46-45-34(44-35(4,5)6)37-30(32(40)41)20-24-12-16-27(39)17-13-24;;/h9-19,30-31,39H,8,20-21H2,1-7H3;;/q-2;2*+1/rC36H42NNaO8Pd/c1-8-26(39)21-36-29-19-23(3)11-18-28(29)35(7,25-14-9-22(2)10-15-25)32-43-38-45-31(41)30(20-24-12-16-27(40)17-13-24)37(47(36,38,45)46(32)38)33(44-48-36)42-34(4,5)6/h9-19,30,36,40H,8,20-21H2,1-7H3
charge 0 multiplicity 1
89 atoms
Pd -0.62764213 0.14994206 -1.38745576
C  -3.16035822 -0.59625328 -0.28211379
O  -2.51951923 -1.59440983 0.17766623
C  1.91109854 -0.57872351 3.31733912
C  2.63352548 -0.46562811 2.13151454
C  0.79287678 -1.37848791 0.85962735
C  0.08729192 -1.49195127 2.07373539
C  0.61685241 -1.11557545 3.31014727
H  2.3565891 -0.23813971 4.25634664
H  -0.93651194 -1.87872158 2.04366802
C  2.31576572 0.59128981 -0.94009742
O  1.3926405 0.4645024 -1.83667052
O  2.61886288 1.69603531 -0.46591526
C  0.05293354 -1.73408855 -0.40478297
H  0.69544134 -1.63622661 -1.27939882
H  -1.31955275 -1.41590128 -0.21202811
C  2.12368777 -0.89351057 0.89249881
C  2.97638504 -0.68495012 -0.38800684
H  3.63262176 -0.02848276 2.17415954
C  2.93920544 -1.87223864 -1.38646775
H  2.69375275 -2.8147622 -0.87346421
H  2.22663295 -1.71539148 -2.20542989
H  3.92656572 -1.99482696 -1.85254273
C  4.46211597 -0.49346616 -0.06298709
C  5.25478144 0.52421668 -0.60082182
C  5.11132655 -1.49560673 0.68178387
C  6.63615761 0.55727011 -0.37276361
H  4.80527012 1.30799008 -1.21096528
C  6.48323371 -1.45951395 0.90854217
H  4.52312235 -2.3224998 1.09151364
C  7.27732659 -0.42260911 0.38961504
H  7.2272368 1.36960293 -0.80613686
H  6.95315721 -2.25353824 1.49677515
Na 0.88720656 2.83224626 -1.55386642
C  -0.17518475 -1.27742215 4.57754913
H  0.02858405 -0.46091251 5.28572264
H  -1.25596843 -1.30095035 4.37335872
H  0.0839296 -2.22019286 5.08684629
C  8.75712137 -0.37749378 0.6531262
H  8.96490597 -0.16692051 1.71469845
H  9.23504235 -1.3414811 0.41997164
H  9.24748028 0.40326713 0.05458744
C  -0.40319692 -3.1982628 -0.46945409
H  -0.96505372 -3.52283507 0.42167101
H  0.48402078 -3.85920745 -0.51517465
C  -1.9257438 -4.84433108 -1.72954986
H  -2.12597098 -5.08799032 -2.78298204
H  -1.26185493 -5.61505326 -1.30705467
C  -1.2243586 -3.51002105 -1.69516934
O  -1.32810912 -2.71286551 -2.61509052
C  -3.23233067 -4.78880699 -0.93598833
H  -3.77582874 -5.74044282 -1.02459964
H  -3.0443084 -4.60764024 0.13301338
H  -3.88597458 -3.98567747 -1.30943565
O  -4.43435094 -0.39316657 -0.00355501
C  -5.09170907 -0.90382558 1.20423535
C  -4.2782142 -0.50956079 2.4301091
C  -5.29281254 -2.40710123 1.09929124
C  -6.42660317 -0.17671717 1.19077985
H  -4.83317514 -0.79394188 3.33613954
H  -3.30249498 -1.01693153 2.45442373
H  -4.11872883 0.57998262 2.4549374
H  -5.77689971 -2.66167037 0.14409433
H  -4.34117534 -2.9468615 1.17657404
H  -5.94990824 -2.73934162 1.91680743
H  -6.27122625 0.91240333 1.22714598
H  -6.98897526 -0.42330747 0.27802348
H  -7.0244316 -0.47558384 2.06347591
N  -2.5622532 0.27558216 -1.06704455
C  -3.15741521 1.56331059 -1.39206314
C  -2.23232523 2.31008784 -2.3452419
H  -4.14124991 1.43630858 -1.86984108
C  -3.31916349 2.4772398 -0.14831255
O  -1.00470818 1.85883658 -2.40387236
O  -2.60307204 3.31712019 -2.9278247
H  -3.85796017 3.37974426 -0.47354234
H  -3.95194971 1.9523487 0.58303025
C  -1.98577467 2.85160806 0.44372852
C  -1.38363221 4.08128265 0.13985387
C  -1.24417917 1.93227345 1.20494515
C  -0.08189949 4.38183859 0.55572071
H  -1.9384333 4.81566134 -0.45156842
C  0.0619927 2.20678381 1.60816613
H  -1.68604537 0.96882823 1.48134435
C  0.65744747 3.43263924 1.27690319
H  0.37797291 5.34481103 0.31821918
H  0.63262909 1.47000443 2.18067068
O  1.93127392 3.73079918 1.61617338
H  2.40711347 2.91977123 1.86708257
