program: Gaussian 09
title: 000075713
version: EM64L-G09RevD.01
frameworkgroup: C1[X(C6H9NO2)]
method: RPBEPBE
basis: SDD
operation: Freq
keyword: #pfreq=noraman
keyword: PBEPBE/SDD
title: #p freq=noraman PBEPBE/SDD
converged: NO YES NO YES
title: Mulliken charges:
elementType: O O N C C C C C C H H H H H H H H H
charge: -0.221084 -0.213259 0.020132 -0.402853 -0.410528 -0.482674 -0.437809 0.352276 -0.304725 0.219433 0.211247 0.218017 0.212410 0.245774 0.259379 0.230698 0.233123 0.270444
chargesum: 0.00000
title: Mulliken charges with hydrogens summed into heavy atoms:
elementType: O O N C C C C C C
charge: -0.221084 -0.213259 0.020132 0.027827 0.019899 0.022478 0.026012 0.352276 -0.034281
polarizability: 9.81386056e+01 8.44375610e+00 8.84787138e+01 -6.38683908e-01 -2.10537230e+00 4.98849473e+01
1716.lowfreq: -19.6510 -17.4687 -4.8042 -0.0012 -0.0008 -0.0006 63.2528 106.0572 220.3274
frequency: 63.1853 106.0555 220.3273 232.2230 278.1381 352.4595 397.5953 468.3449 496.8964 533.2240 659.9018 704.7560 772.5325 797.8244 847.2786 873.4806 928.4044 934.3950 954.0659 1029.9851 1064.3510 1080.6432 1106.3975 1137.3011 1170.4525 1207.5376 1235.2272 1257.8335 1297.4683 1331.5799 1335.9562 1347.6749 1355.5964 1377.3877 1441.8951 1457.5294 1471.0909 1474.7617 1667.3973 2957.4152 2987.4260 2989.9148 2992.1849 3014.8819 3051.8642 3054.1843 3063.1485 3142.2948
redmass: 6.7197 2.7087 2.2030 5.8130 1.9039 5.3490 2.2769 2.8117 7.2565 3.4113 4.0574 3.8406 4.2846 1.4053 2.8175 1.5428 2.1003 1.4025 2.7665 4.1639 1.6468 1.9016 1.5143 1.1709 1.4775 12.6484 1.3112 1.1902 1.3002 1.7080 1.4500 1.5782 2.3007 3.7786 1.1020 1.0890 1.0857 1.0899 7.0491 1.0652 1.0676 1.0625 1.0642 1.0905 1.0946 1.0995 1.1024 1.0910
irintensity: 0.0650 1.9011 0.3126 2.1831 0.4637 2.3411 0.7478 1.5138 1.2130 2.0836 20.6036 10.7127 15.6558 4.5763 1.6376 5.4575 20.6653 9.6771 2.5267 4.9139 15.9434 1.6051 6.6223 2.6484 4.2161 209.1605 0.9095 4.5837 1.3739 5.6471 4.9639 0.5538 58.3886 71.3783 20.8903 18.3997 11.9216 8.5303 44.5940 18.1381 23.2254 25.5128 12.1779 30.8223 26.8595 30.0408 47.6413 0.0850
temp: 298.150 k
press: 1.00000 atm
elementType: 8 8 7 6 6 6 6 6 6 1 1 1 1 1 1 1 1 1
symmnumber: 1
zpe: 381145.0 jmol-1
zpe.correction: 0.145170 hartree
zpe.thermalcorrener: 0.153321 hartree
zpe.thermalcorrenthalpy: 0.154265 hartree
zpe.thermalcorrgfe: 0.111954 hartree
zpe.sumelectzpe: -438.449264 hartree
zpe.sumelectthermal: -438.441113 hartree
zpe.sumelectthermalent: -438.440169 hartree
zpe.sumelectthermalfe: -438.482480 hartree
dipole: 5.5810 0.3556 -0.1247
dipole: 5.5937
quadrupole: -63.1218 -52.3290 -52.0289
quadrupole: 0.8758 0.1304 0.2240
quadrupole: -7.2952 3.4976 3.7976 0.8758 0.1304 0.2240
hfenergy: -438.594434 hartree
pointgroup: C01 [X(C6H9N1O2)]
dipole: -2.1950648 -0.1544998 -0.0332628 debye
dipolederiv: -0.7572349 0.2012657 -0.0068855 0.2736485 -0.6566527 -0.0038832 -0.004394 -0.0006888 -0.237012 -0.606843 -0.2396344 -0.0036125 -0.1101165 -0.7573924 -0.0020661 -0.004854 -0.0056128 -0.2398027 1.4866394 0.2345048 0.0023676 -0.045531 1.0842514 0.0266375 0.0048466 0.0177408 0.1971509 0.0867889 -0.0440652 -0.0039503 -0.0016565 0.0623842 0.0349769 0.0233426 0.0143715 0.136878 0.093531 -0.0133529 0.0369141 -0.054653 0.0195748 0.0204819 0.0322166 0.0408126 0.1260213 -0.036222 -0.0076009 -0.0005983 0.0278167 -0.075141 0.0318957 -0.0011896 0.0061953 0.156277 -0.1651487 -0.0368519 -0.0021835 -0.1610577 -0.002998 0.0112168 -0.1115065 -0.0383619 0.1342288 -0.533154 -0.2903269 0.0023325 -0.5359787 0.1376728 -0.0309045 -0.0084533 0.0091282 -0.0341928 0.4029332 0.1705206 0.0016255 0.4090166 0.0369628 -0.0078422 0.0475995 0.0005514 -0.130608 -0.0152982 0.1024988 0.0042316 0.1218687 -0.135217 -0.0027974 0.0220906 -0.0271579 0.082447 0.0413361 -0.0173867 -0.0018532 -0.0459768 0.0650317 -0.0703435 -0.0289907 -0.0104122 -0.1651821 -0.2104437 -0.0170356 -0.0220795 -0.019992 0.0605829 -0.0007469 -0.0549513 0.0001231 0.0785561 0.0919769 -0.0049627 -0.0410018 0.0242702 0.0193957 -0.0430261 0.0246116 -0.0343867 -0.1624612 0.0541332 0.0347446 -0.0192884 0.0123252 0.0195393 -0.0595956 -0.0358933 -0.0899071 -0.0678996 0.0252946 -0.0541521 0.063103 -0.0279627 0.0350751 0.0589511 0.051525 0.075141 0.0250818 -0.012242 -0.0490818 -0.0491483 0.0457891 0.0770254 -0.067371 -0.0392363 -0.1082504 -0.0684636 0.0150279 -0.0387011 0.0344232 0.0275006 -0.032902 0.10012 0.0843725 0.1414382 0.0088044 0.0389255 0.0696176 0.0056038 0.0606891 0.0428069 0.0042966 -0.0011358 0.0092755 0.1601766 unknown
polarizability: 98.0534594|8.5128967|88.6435312|-0.1524755|-1.1713995|49.8052761 unknown
InChI: InChI=1S/C6H9NO2/c8-7(9)6-4-2-1-3-5-6/h4H,1-3,5H2
charge 0 multiplicity 1
18 atoms
O  2.455978 -1.118593 0.014128
O  2.383906 1.161706 0.029241
N  1.809003 0.000756 0.010512
C  -1.849742 1.16603 -0.455982
C  -2.510451 0.026709 0.353926
C  -0.357918 1.336609 -0.076904
C  -1.815894 -1.326635 0.069017
C  0.323515 -0.010994 -0.008175
C  -0.310378 -1.214978 0.038055
H  -2.382534 2.119226 -0.285023
H  -1.931038 0.940305 -1.537726
H  -3.586703 -0.046178 0.112546
H  -2.436399 0.257267 1.434879
H  -0.259369 1.851142 0.898975
H  0.165181 1.979878 -0.806503
H  -2.155869 -1.737358 -0.906297
H  -2.108244 -2.084845 0.822349
H  0.297757 -2.127948 0.056082
