program: Gaussian 16
title: SMD(2-propanol)-MN15/BS1
version: ES64L-G16RevC.01
method: RMN15
basis: GenECP
operation: Freq
keyword: #N
keyword: Geom=AllCheck
keyword: Guess=TCheck
keyword: SCRF=Check
keyword: GenChk
keyword: RMN15/GenECP
keyword: Freq
converged: YES YES YES YES
title: Mulliken charges:
elementType: Pd C O C C C C C H H C O O C H H C C H C H H H C C C C H C H C H H Na C H H H C H H H C H H C H H C O C H H H O C C C C H H H H H H H H H N C C H C O O H H C C C C H C H C H H O H
charge: 0.000580 0.318626 -0.318420 -0.029160 -0.082285 0.074652 -0.119474 -0.046336 -0.018903 -0.027136 0.230444 -0.378753 -0.313407 -0.133383 0.040317 0.236596 0.085494 -0.234284 -0.012581 0.212659 0.007470 0.004696 0.005024 0.005004 0.018657 -0.009209 -0.041923 0.003900 -0.030413 -0.012110 -0.073520 -0.012440 -0.012270 0.542637 0.097029 0.020617 0.029029 0.042522 0.085497 0.034818 0.022475 0.038033 0.188418 0.017712 0.051177 -0.002794 0.037979 0.046832 0.011149 -0.241754 0.015640 0.027045 0.022215 0.021975 -0.278876 -0.187953 0.074523 0.093158 0.083935 0.023002 0.027398 0.030700 0.024413 0.030258 0.031105 0.027427 0.028236 0.026462 -0.291950 0.025301 0.200430 0.048924 0.187484 -0.397437 -0.301152 0.023611 0.003902 -0.093843 0.054557 -0.003067 0.020171 -0.024890 -0.097932 0.014059 0.141061 -0.043927 0.031978 -0.208034 0.230599
chargesum: -0.00000
title: Mulliken charges with hydrogens summed into heavy atoms:
elementType: Pd C O C C C C C C O O C C C C C C C C C C Na C C C C C O C O C C C C N C C C O O C C C C C C O
charge: 0.000580 0.318626 -0.081824 -0.048063 -0.094866 0.074652 -0.146610 -0.046336 0.230444 -0.378753 -0.313407 -0.093066 0.085494 -0.234284 0.229849 0.005004 0.022557 -0.021320 -0.054363 -0.042682 -0.073520 0.542637 0.189197 0.180823 0.257307 0.082018 0.011149 -0.241754 0.086875 -0.278876 -0.187953 0.155624 0.178934 0.166059 -0.291950 0.074225 0.200430 0.214996 -0.397437 -0.301152 -0.093843 0.029668 0.010993 -0.023756 -0.065954 0.141061 0.022565
1716.lowfreq: -1491.9314 -5.0750 0.0008 0.0011 0.0012 2.4316 4.7787 23.3336 30.5650
frequency: -1491.9313 23.3091 30.5224 33.1096 37.7083 40.4492 42.6624 50.1806 51.9224 54.7321 59.7605 62.7523 69.4954 72.1764 74.9118 79.9461 80.7440 83.2375 89.3729 97.8597 99.3389 116.6093 120.5926 120.8696 135.8232 145.3390 151.1721 163.3097 166.2315 167.7089 182.8073 188.5657 195.0103 208.9079 211.6884 213.8782 217.9877 224.1973 231.7511 236.5031 247.1259 253.6778 255.3642 263.6702 278.1819 286.2762 289.8405 307.2897 313.9888 330.2804 335.1295 343.8166 348.2327 350.4847 358.0422 362.1858 363.7630 381.2885 386.5748 401.5330 406.8428 414.3731 416.7646 420.7916 429.7204 435.0336 441.8096 443.6991 452.2797 455.6126 463.4495 473.6140 477.2045 492.7090 516.6878 529.5370 533.5531 544.8981 579.9963 584.5894 593.4888 609.1480 626.2646 632.4348 634.9622 666.8104 668.0802 707.8433 722.4942 727.0309 736.2539 744.5295 747.1244 748.7847 754.3033 757.2159 773.0016 787.9304 809.5498 818.8937 830.8270 843.1055 847.4523 858.0372 864.8796 866.5413 871.4270 879.8224 883.9032 892.0927 895.7008 914.1897 917.5408 920.9205 924.8335 929.4117 938.0282 949.7511 953.9952 982.5256 985.9310 986.6671 994.4034 997.8184 1000.9930 1004.0778 1008.1513 1009.2331 1013.6943 1014.5484 1015.2486 1021.2263 1026.2019 1040.1948 1041.3809 1044.8766 1046.0762 1056.6249 1075.2028 1094.3745 1112.3938 1114.1896 1123.0029 1125.1282 1127.8422 1150.7853 1151.4673 1160.6844 1163.4046 1171.0464 1172.5560 1179.6949 1184.1995 1213.5316 1218.1282 1224.0875 1226.1690 1233.8691 1240.4745 1251.1867 1255.0876 1260.5785 1264.6129 1268.2178 1272.2050 1298.7185 1301.2589 1303.7862 1310.3599 1322.5646 1334.4461 1344.2579 1349.6952 1353.8645 1361.2704 1362.3961 1363.5422 1366.0598 1370.1909 1372.4417 1374.1292 1375.4136 1380.8105 1384.4869 1403.3680 1403.8770 1408.5728 1411.3365 1413.8055 1416.9159 1418.1423 1419.8385 1421.0576 1422.4590 1428.2783 1428.4991 1430.2073 1433.2809 1433.5758 1438.8151 1441.1921 1443.8008 1446.8624 1454.5828 1464.5661 1476.3531 1533.1315 1550.1360 1558.6352 1569.0977 1636.0390 1649.2582 1661.7644 1684.7520 1686.5126 1695.0834 1697.1186 1699.8139 1789.3426 1814.6183 3052.9228 3070.5305 3070.7951 3071.8565 3074.5014 3077.4915 3082.5611 3083.8142 3084.0771 3085.4770 3099.4450 3115.6196 3125.3710 3153.7715 3155.3179 3165.1801 3171.4075 3175.4796 3176.7774 3178.0749 3178.2694 3181.4143 3182.5610 3182.9444 3183.2636 3188.8417 3189.8754 3194.5407 3196.0795 3198.9484 3205.6600 3207.5635 3210.8829 3211.8982 3213.9523 3221.8836 3222.6188 3225.6773 3247.3332 3280.5395 3831.3934
redmass: 1.0829 3.2418 3.6690 3.4587 3.9681 2.7913 4.1251 3.4896 2.1503 2.3043 3.0433 3.9544 4.1819 3.6063 2.1337 2.4842 3.0518 5.9805 5.3885 7.2511 5.2318 5.7389 5.3376 5.8684 6.4129 3.8059 3.7583 5.9912 4.7064 6.3318 6.0992 4.6529 4.9730 1.9765 5.7786 2.5300 3.4030 3.1424 2.9682 1.4469 3.2134 3.3419 1.4339 5.8528 3.9981 1.1231 4.9862 4.8418 5.2956 3.7322 2.7491 4.1982 3.2592 2.3183 3.5675 1.6870 3.0155 3.9127 3.9461 5.9877 3.8236 4.4081 3.2059 3.1126 3.0120 4.8228 3.2928 1.8427 1.9942 2.8942 2.2025 4.5228 2.2852 3.8991 4.4034 3.7141 3.6287 3.3282 4.0549 3.0066 4.2948 3.4407 4.8171 6.6930 6.2729 4.6649 4.9369 4.9539 2.5117 2.0237 4.1241 4.1887 2.7786 3.4265 4.4041 4.3381 7.9678 3.1959 4.3260 5.0206 3.8341 1.5172 1.5404 3.2130 1.2856 1.4601 2.1565 2.2555 1.8598 2.6449 2.5792 1.9091 1.8054 1.4936 1.5397 2.5567 1.2021 2.7226 2.8195 1.3882 1.3887 1.3528 1.4205 1.4906 1.4160 2.0231 1.6794 1.8817 2.2437 1.5727 1.5203 1.4192 1.4326 1.6263 2.6415 1.6177 1.4777 2.3078 2.2941 1.2370 2.3325 1.3141 1.7753 2.0123 1.7906 1.0916 1.8889 1.8023 1.6383 1.2804 1.0957 1.5285 2.2623 2.0762 2.0527 2.0214 1.6276 1.6803 1.9622 1.2944 2.5526 2.0965 1.5261 2.0268 3.4290 1.9402 1.3061 1.4842 1.4534 3.0181 1.9126 2.0767 2.7148 4.8247 1.2865 1.1220 1.4830 1.1863 1.4595 1.4371 1.3449 1.4066 5.7874 1.4626 1.0795 1.7681 2.6476 1.9840 1.3596 1.0991 1.1434 1.0514 1.0561 1.0742 1.1930 1.1581 1.0350 1.1272 1.6202 1.5780 1.2403 1.9112 1.0881 2.8348 3.3907 1.2783 3.5574 3.2607 3.7825 4.8203 6.8655 7.3320 6.9921 9.5592 7.8992 7.6991 7.4589 9.3931 12.5713 11.6291 1.0804 1.0459 1.0582 1.0390 1.0379 1.0375 1.0365 1.0644 1.0449 1.0388 1.0618 1.1006 1.0862 1.1017 1.1030 1.1071 1.1038 1.0901 1.1055 1.1046 1.1041 1.1046 1.1048 1.1052 1.1048 1.1046 1.1047 1.1053 1.0915 1.0894 1.0910 1.0885 1.1036 1.0885 1.0964 1.0967 1.0927 1.0968 1.0939 1.0910 1.0665
irintensity: 3729.4336 2.2122 1.8836 0.9847 0.5168 2.1366 2.2403 0.0528 4.8891 0.2754 2.4138 1.8684 2.0343 2.5137 2.3364 6.9865 7.1923 4.2327 12.8933 16.5581 2.1394 4.6708 5.8844 12.3131 4.8820 1.8165 3.2277 0.7735 8.5674 3.2229 3.3326 12.6875 1.2800 4.2238 18.1832 3.7812 6.8809 5.2009 0.3242 2.0326 20.8527 0.3305 3.9442 19.2677 13.8606 0.1198 7.7578 29.2375 33.3325 54.8885 95.2044 3.6901 5.1633 18.4305 8.7723 75.7967 4.2770 27.3585 5.4488 31.6006 73.9419 3.9934 42.9715 12.3804 8.1053 14.1061 1.5551 4.0610 2.3981 10.9675 4.2345 1.2748 0.4263 8.9011 4.5842 18.4413 1.6169 9.9813 39.6477 36.0848 5.9961 28.5646 25.5525 0.4401 1.3750 12.8429 33.6265 59.3073 4.5098 11.2463 4.7727 14.9524 14.0932 11.7300 25.3550 2.1793 54.4332 42.1288 1.9301 4.7283 37.5367 14.1025 39.0222 21.3974 1.8253 3.5237 8.3420 33.5694 14.9247 10.0290 86.6444 32.4833 7.6667 1.4655 2.9407 39.3310 0.1200 8.3629 2.2747 5.1322 11.2899 9.5091 2.5086 8.6322 16.4372 12.8851 10.4334 21.9169 14.9877 3.6912 1.0628 0.4952 1.5051 12.1005 46.0869 14.0998 6.3908 6.7448 8.3482 26.7289 18.5499 12.5258 46.4194 38.1857 15.6064 2.4555 68.1721 13.6565 79.1305 225.4500 15.4478 157.7901 319.5979 44.6595 16.7625 26.0128 10.6526 40.6054 0.1049 11.8857 4.4290 21.5878 14.8462 36.7896 12.7434 57.2296 3.3677 11.5268 21.0198 154.8757 67.3267 2.9862 39.3093 1.7211 2.3056 11.2964 47.5144 69.6736 52.7069 4.5811 41.3391 5.7556 75.4307 45.2980 20.1533 175.9224 958.5240 245.6689 27.3262 7.4777 42.4685 1.6918 7.9616 8.6180 40.9507 22.5828 11.0046 0.5117 133.3688 139.5676 23.3961 20.4344 1.4129 102.7110 5.4578 228.9433 37.2119 74.5455 397.7530 704.8446 12.4990 4.4866 20.8405 948.9341 531.1931 152.3214 108.0915 241.3342 1186.4696 366.4563 2.3782 19.2032 43.7434 31.4489 19.3150 20.2165 22.0228 33.5562 10.6627 15.4803 26.0514 7.1740 35.3582 17.5771 14.2540 11.6168 22.8509 25.6450 33.8903 18.6069 26.6634 28.5045 22.2630 19.5988 27.7880 11.9139 31.9458 26.8329 10.9245 5.3864 9.6665 15.7897 12.0329 6.9713 3.9682 25.5240 16.1858 6.3545 7.2656 4.2508 263.6543
temp: 333.150 k
press: 1.00000 atm
elementType: 46 6 8 6 6 6 6 6 1 1 6 8 8 6 1 1 6 6 1 6 1 1 1 6 6 6 6 1 6 1 6 1 1 11 6 1 1 1 6 1 1 1 6 1 1 6 1 1 6 8 6 1 1 1 8 6 6 6 6 1 1 1 1 1 1 1 1 1 7 6 6 1 6 8 8 1 1 6 6 6 6 1 6 1 6 1 1 8 1
symmnumber: 1
zpe: 1876442.3 jmol-1
zpe.correction: 0.714699 hartree
zpe.thermalcorrener: 0.773427 hartree
zpe.thermalcorrenthalpy: 0.774482 hartree
zpe.thermalcorrgfe: 0.617527 hartree
zpe.sumelectzpe: -2338.901309 hartree
zpe.sumelectthermal: -2338.842580 hartree
zpe.sumelectthermalent: -2338.841525 hartree
zpe.sumelectthermalfe: -2338.998481 hartree
dipole: -2.6257 -3.3091 2.4660
dipole: 4.8914
quadrupole: -266.6273 -286.3137 -269.5062
quadrupole: -16.1932 22.6493 19.4048
quadrupole: 7.5218 -12.1647 4.6429 -16.1932 22.6493 19.4048
hfenergy: -2339.6160078 hartree
pointgroup: C01 [X(C36H42N1Na1O8Pd1)]
dipole: -1.0330374 -1.3018847 0.9702082 debye
polarizability: 644.6584483|34.0636749|614.5708156|0.6456801|-6.8803822|666.9629476 unknown
InChI: InChI=1/C22H25O3.C14H17NO5.Na.Pd/c1-5-19(23)12-9-17-14-16(3)8-13-20(17)22(4,21(24)25)18-10-6-15(2)7-11-18;1-14(2,3)20-13(19)15-11(12(17)18)8-9-4-6-10(16)7-5-9;;/h6-8,10-11,13-14H,5,9,12H2,1-4H3;4-7,11,16H,8H2,1-3H3;;/q2*-1;2*+1/rC36H42NNaO8Pd/c1-8-26(39)21-36-29-19-23(3)11-18-28(29)35(7,25-14-9-22(2)10-15-25)32-44-38-45-31(41)30(20-24-12-16-27(40)17-13-24)37(33(42)43-34(4,5)6)47(36,45,48-36)46(32)38/h9-19,30,36,40H,8,20-21H2,1-7H3
charge 0 multiplicity 1
89 atoms
Pd 0.54156826 0.69089688 -0.8499868
C  2.55212327 1.77107517 0.87398993
O  1.64505865 1.69358424 1.74602364
C  -0.91281761 -3.02902726 2.86348901
C  -1.58388874 -2.8999759 1.64847173
C  -0.95305547 -0.57533671 1.43915029
C  -0.28190364 -0.74564134 2.66910873
C  -0.23531907 -1.93529193 3.40043008
H  -0.92107607 -3.98822956 3.38839578
H  0.23429194 0.12322405 3.08940232
C  -1.54152693 -1.46974864 -1.60865287
O  -1.02400314 -0.29733042 -1.73854363
O  -1.3538634 -2.34686227 -2.46615436
C  -0.77383615 0.84224024 0.90271852
H  -0.60197285 1.41987027 1.83108307
H  0.54910466 1.25641034 1.01586903
C  -1.63061941 -1.71156393 0.89852544
C  -2.46090631 -1.75126416 -0.40677973
H  -2.09326812 -3.78588194 1.27432683
C  -3.11975656 -3.11739469 -0.65644696
H  -3.82373145 -3.36185031 0.15200546
H  -3.68506185 -3.06459334 -1.59750985
H  -2.37530156 -3.91923998 -0.75215418
C  -3.62190152 -0.75323025 -0.36968662
C  -4.0832424 -0.12137506 -1.53285566
C  -4.31701586 -0.52514649 0.82208402
C  -5.14655162 0.7791452 -1.48396674
H  -3.58921084 -0.30883634 -2.49130289
C  -5.39218214 0.36643827 0.86712542
H  -4.00069781 -1.03261914 1.7382105
C  -5.8106457 1.05649529 -0.27803266
H  -5.47002902 1.27978693 -2.4015751
H  -5.90990253 0.53848801 1.81539881
Na 0.37683836 -1.15999335 -3.48564062
C  0.498385 -2.00455642 4.71045955
H  0.56106983 -3.03739944 5.08090031
H  1.52171355 -1.60932528 4.61501577
H  -0.00775388 -1.40004751 5.48006129
C  -6.92655163 2.06332794 -0.22703816
H  -7.63960373 1.9154693 -1.05218473
H  -7.47797054 2.00485811 0.72200765
H  -6.53454658 3.08936679 -0.32262417
C  -1.89312941 1.66448357 0.26647145
H  -2.81833942 1.60327222 0.86577183
H  -2.18180073 1.32270433 -0.73573497
C  -2.68471301 4.01457635 -0.33587228
H  -3.13489859 3.54117977 -1.22606737
H  -3.4681975 3.95819232 0.44127527
C  -1.55582919 3.12461085 0.12664794
O  -0.44284213 3.56884906 0.36333733
C  -2.26086745 5.44656884 -0.60079012
H  -1.49734668 5.49305647 -1.39159846
H  -3.11736432 6.05836538 -0.91761418
H  -1.82973542 5.90299893 0.30224493
O  3.78917325 2.15332425 1.14891103
C  4.31442234 2.26275451 2.50886787
C  5.77608047 2.61506617 2.28034263
C  4.19420915 0.91545325 3.20847014
C  3.60599268 3.38190156 3.25833887
H  6.27704185 1.82442119 1.70121836
H  5.8612115 3.56360035 1.7295217
H  6.29117647 2.7221382 3.245601
H  3.14440712 0.63090423 3.36575988
H  4.69625265 0.1327993 2.61747933
H  4.68776141 0.97107096 4.18996894
H  2.5601974 3.1289909 3.47192419
H  4.12574315 3.56323964 4.21089606
H  3.63593459 4.31045243 2.66818481
N  2.28923197 1.46989616 -0.3880675
C  3.33809814 1.22956852 -1.36519417
C  2.69463117 0.9713442 -2.72030598
H  4.01658758 2.09310388 -1.4479581
C  4.17602664 -0.03542667 -1.03375814
O  1.42762507 0.65684732 -2.67885762
O  3.35246264 0.96768209 -3.75100868
H  4.93820056 -0.14226564 -1.82087219
H  4.69328117 0.1399872 -0.07822823
C  3.30408177 -1.26005692 -0.95201062
C  2.66191942 -1.60245028 0.24809802
C  2.99515021 -2.01378189 -2.093699
C  1.7247793 -2.63151122 0.3061452
H  2.89230264 -1.04215366 1.16169164
C  2.04964849 -3.04407461 -2.05346111
H  3.49481683 -1.78029201 -3.04007973
C  1.39268598 -3.34679779 -0.85111127
H  1.22490346 -2.8861934 1.24271715
H  1.83366176 -3.64190364 -2.94619891
O  0.46013222 -4.32108141 -0.75149421
H  0.26168546 -4.70249262 -1.6228612
