program: Gaussian 16
title: SMD(2-propanol)-MN15/BS1
version: ES64L-G16RevC.01
method: RMN15
basis: GenECP
operation: Freq
keyword: #N
keyword: Geom=AllCheck
keyword: Guess=TCheck
keyword: SCRF=Check
keyword: GenChk
keyword: RMN15/GenECP
keyword: Freq
converged: YES YES NO YES
title: Mulliken charges:
elementType: Pd C O C C C C C H H C O O C H H C C H C H H H C C C C H C H C H H Na C H H H C H H H C H H C H H C O C H H H O C C C C H H H H H H H H H N C C H C O O H H C C C C H C H C H H O H
charge: -0.024531 0.314621 -0.316682 -0.033475 -0.096413 0.067352 -0.117401 -0.042715 -0.017167 -0.023756 0.235901 -0.373917 -0.311760 -0.118996 0.039522 0.243114 0.088797 -0.248255 -0.004278 0.217564 0.005205 0.000606 0.009077 0.028307 -0.018853 -0.005035 -0.008725 0.004624 -0.039049 -0.010501 -0.076699 -0.011977 -0.012847 0.547438 0.096922 0.043816 0.021011 0.030197 0.085961 0.035197 0.030913 0.024762 0.138115 0.035632 0.072293 0.051191 0.019757 0.060710 0.001692 -0.243115 -0.011783 0.030022 0.011333 0.031600 -0.278027 -0.188714 0.083208 0.074198 0.095965 0.026577 0.027640 0.028276 0.030558 0.023382 0.027312 0.030646 0.030384 0.025449 -0.292529 0.025675 0.203072 0.049402 0.184611 -0.398101 -0.301499 0.022820 0.004905 -0.087911 -0.009635 0.042351 -0.078909 0.016960 0.021805 -0.029648 0.135032 0.031965 -0.042926 -0.210173 0.220562
chargesum: -0.00000
title: Mulliken charges with hydrogens summed into heavy atoms:
elementType: Pd C O C C C C C C O O C C C C C C C C C C Na C C C C C O C O C C C C N C C C O O C C C C C C O
charge: -0.024531 0.314621 -0.316682 -0.050643 -0.100691 0.067352 -0.141157 -0.042715 0.235901 -0.373917 -0.311760 0.163640 0.088797 -0.248255 0.232451 0.028307 -0.014230 -0.015536 -0.020702 -0.051896 -0.076699 0.547438 0.191945 0.176832 0.246041 0.131658 0.001692 -0.243115 0.061171 -0.278027 -0.188714 0.165701 0.155450 0.182444 -0.292529 0.075077 0.203072 0.212337 -0.398101 -0.301499 -0.087911 0.007325 0.012703 -0.046945 -0.021122 0.135032 0.010389
chargesum: 0.00000
1716.lowfreq: -1475.3113 -0.0002 0.0008 0.0011 4.6947 7.7796 9.1969 30.6153 31.7714
frequency: -1475.3113 30.6090 31.7511 37.3206 42.0489 43.6552 47.6696 50.8755 52.4284 56.2052 59.6143 66.2005 67.7149 72.1062 73.5941 80.5078 85.2008 92.8758 94.3598 101.7023 115.2241 120.8539 126.9818 133.7890 137.4501 150.5983 154.2820 164.9864 170.3249 172.1593 182.2728 191.8103 194.6901 206.6793 214.0459 216.6335 217.7389 221.3133 233.0083 247.5078 250.1641 254.9531 259.8670 263.4759 281.1443 285.8610 288.4018 314.1654 328.6089 340.1362 343.8273 350.2044 353.2309 356.1998 364.7334 378.7790 386.1487 387.3109 404.0711 410.4780 417.3873 418.9102 422.6435 434.8448 436.4790 442.9596 446.0597 454.7936 456.4794 461.9572 475.5007 478.3294 494.5765 513.4843 519.2527 526.7122 531.5764 549.6195 575.1087 581.8647 586.5777 615.6694 619.9836 632.7489 636.7774 642.9411 668.1922 708.4003 726.6022 737.1165 744.2388 745.0240 746.7501 748.8814 755.1177 756.6418 774.2891 789.5889 809.9520 819.6897 833.3665 845.7376 847.6323 858.3513 859.2140 866.3494 870.8136 880.5735 886.8497 894.4182 897.0085 914.5682 920.9866 922.3733 924.9579 928.8752 938.2407 947.4575 952.1627 963.9720 974.0199 982.0818 986.6035 999.5339 1000.3748 1003.0398 1005.2151 1011.4924 1013.2517 1015.8988 1020.8696 1021.9306 1026.5961 1040.0834 1040.7990 1043.0406 1053.3463 1074.0641 1085.0879 1098.9731 1110.3755 1115.3705 1125.3277 1126.6930 1148.5681 1154.5180 1159.8083 1163.4936 1172.1358 1174.0235 1182.4232 1186.8966 1189.7322 1215.6222 1222.1672 1225.9936 1226.8433 1236.0326 1239.7140 1244.0009 1255.7850 1260.5018 1266.0902 1268.4238 1275.3995 1299.5424 1302.4048 1309.2679 1316.7399 1325.0266 1328.8161 1342.9129 1349.5566 1353.3718 1358.9210 1361.1957 1363.7088 1370.1278 1370.9209 1371.6100 1374.1613 1376.8599 1383.9089 1384.5988 1391.6703 1403.2339 1408.0730 1409.5813 1410.8566 1417.4690 1419.6841 1419.7777 1420.0195 1420.2466 1428.3337 1430.1236 1432.7345 1433.4475 1434.8699 1438.9858 1439.9271 1443.2459 1446.9878 1453.1532 1467.7517 1479.6703 1535.1023 1550.1176 1560.4284 1566.5405 1635.4264 1650.2931 1664.1890 1685.2586 1686.8815 1695.2670 1697.2688 1700.1038 1789.5894 1811.4534 3057.0568 3062.7795 3064.1844 3070.0218 3072.6100 3074.3359 3077.5390 3077.9627 3083.1150 3085.4331 3100.9621 3124.3179 3148.6346 3149.6376 3156.3406 3166.5837 3168.5849 3169.2829 3171.6118 3176.9571 3177.9965 3183.3262 3183.8138 3185.4900 3187.2877 3188.2307 3189.6391 3192.3750 3203.3483 3204.6233 3205.1297 3210.4792 3210.9763 3212.9825 3221.6327 3221.8336 3223.0467 3226.8288 3230.7967 3273.8287 3814.5376
redmass: 1.0843 4.1056 3.6019 4.5731 1.5603 2.7880 2.2318 2.7643 2.2470 1.4079 3.8471 4.9904 5.6682 4.3869 6.1321 7.4630 4.9096 4.9176 4.5618 6.7938 5.9056 6.8881 5.6670 6.1990 6.9099 4.5864 3.3429 5.1221 5.4958 4.6908 5.9101 4.1870 6.9341 3.8022 3.1440 4.1236 2.0751 3.3071 3.1855 2.5939 3.6523 1.9390 1.7119 3.2932 3.1930 1.2946 3.0013 6.5408 4.2567 4.3912 2.9471 3.9498 3.4122 2.9589 2.8772 3.8196 3.2937 3.5149 6.3812 3.8400 3.5369 3.0794 3.0034 5.3212 3.1767 3.1700 2.6526 2.2393 2.3309 1.6123 3.9033 1.5980 2.5539 3.4227 4.6407 2.9640 3.6130 3.2979 4.2381 3.6740 3.0202 3.4163 3.4804 6.7275 6.2723 6.1477 5.2697 5.0636 5.1998 4.1458 1.6918 4.0430 2.6528 4.0238 4.3183 2.6612 8.1292 3.3488 4.3626 5.0121 3.9745 1.5425 1.5079 3.6163 2.8497 1.3013 1.4053 2.0833 1.7147 2.6589 2.7197 2.4760 1.4809 1.4578 1.5348 2.5198 1.2031 2.0859 2.5184 1.7501 1.3064 1.3857 1.3773 1.7345 1.6563 1.3967 1.6580 1.9969 2.8281 1.3851 1.4230 1.4653 1.4312 1.6202 1.6385 1.4897 2.5109 2.2783 2.1432 1.2445 2.4291 1.3302 2.0132 1.7766 1.4652 2.4669 1.1567 1.5280 1.5776 1.0950 2.3306 1.5851 1.2832 2.1589 2.4643 1.9689 1.4912 1.6106 1.7515 1.4478 2.6759 2.0954 1.6579 1.9937 2.8968 2.1472 1.3083 1.5094 1.6731 2.0324 2.0651 2.0778 3.4171 4.0806 1.2738 1.2823 1.4856 1.4625 1.3973 1.4718 1.3399 1.2909 1.8383 4.5393 1.1974 1.0476 1.6218 2.1327 1.7519 1.0566 1.1639 1.0710 1.0715 1.0593 1.1756 1.2540 1.5359 1.1254 1.0395 1.6276 1.0956 1.9821 1.0869 2.9189 3.2372 1.2777 3.5046 3.2337 3.6762 4.6003 6.9231 7.3401 6.8864 8.3752 8.8209 7.5845 7.3315 9.6755 12.5724 11.6884 1.0802 1.0717 1.0417 1.0674 1.0390 1.0378 1.0374 1.0384 1.0365 1.0389 1.0618 1.0861 1.0988 1.0990 1.1029 1.1071 1.0916 1.1023 1.1040 1.1055 1.1047 1.1048 1.1056 1.1045 1.1031 1.1048 1.1048 1.1053 1.0895 1.0889 1.0905 1.0908 1.1036 1.0887 1.0962 1.0962 1.0926 1.0965 1.0948 1.0910 1.0657
irintensity: 3682.8836 0.7816 1.8612 1.0169 0.9051 1.2201 0.3079 0.1714 2.4719 0.2383 2.8331 4.6768 0.3664 0.8798 1.2613 12.8426 3.4511 1.8487 6.1805 19.4560 10.1695 10.1423 2.9382 7.5522 4.4111 0.5559 5.5508 5.3959 5.2370 3.6495 0.5404 2.2048 16.1446 2.1874 15.9840 2.2714 9.3071 7.3803 1.6142 6.5304 9.7141 9.4748 2.6234 11.1320 9.5290 0.9629 5.7458 46.6387 12.4772 42.0947 6.8439 11.0250 4.1536 8.5742 0.0908 20.6350 0.6948 0.4329 44.9351 70.7832 4.6871 21.2730 18.1923 8.3771 7.2157 10.6815 1.6907 5.9126 6.7131 26.5338 32.5438 188.7449 36.2912 13.1954 4.8977 12.7711 2.4298 3.0227 10.3953 32.4172 34.8578 46.2966 7.5966 0.3751 0.9648 3.9999 36.7823 56.5565 7.3138 1.1405 8.5757 15.9448 9.8659 14.3712 24.8041 4.4906 61.2658 44.0792 1.5435 3.8507 36.3703 12.8046 38.3975 24.5393 10.5671 1.4851 2.6259 29.5036 9.6989 11.8226 84.0401 32.3927 5.1044 5.4110 0.8011 41.8076 0.1853 14.4124 10.3163 22.7740 55.9531 2.3846 4.7816 2.0573 10.8603 18.0965 10.5030 9.3110 14.7791 0.7402 0.4591 1.7523 1.3114 15.1983 16.5019 10.8303 17.3422 7.5889 3.3153 19.9016 14.4026 13.4365 34.7616 15.8095 59.1448 19.8075 4.9970 5.2077 56.3025 7.5162 401.4472 87.1004 248.4941 50.5624 16.0650 20.7317 22.7236 27.9966 1.0530 10.6071 22.7143 21.4785 34.0935 25.4337 6.4585 28.2370 2.6501 30.3352 189.7683 43.6117 30.6295 7.1191 15.4270 7.4398 117.7808 1.9400 48.0657 53.7438 2.6642 2.7225 40.8465 0.4289 163.9085 20.5091 16.0539 3.3008 321.3444 614.2430 431.4433 1.0564 17.4971 9.5563 11.4865 5.5241 19.8256 59.1794 105.1435 1.4839 13.2091 129.2410 21.1486 23.9907 1.2684 116.0343 61.8928 198.7437 40.5148 71.1485 433.3947 652.6708 10.6437 4.6931 22.3549 502.3480 951.0221 136.9399 107.9750 231.1556 1194.5817 375.3056 1.5988 30.3436 34.4635 12.1672 30.3684 20.1292 20.3918 24.1849 19.6119 15.1508 26.2414 36.2120 22.6608 17.3738 14.3400 10.5179 15.3355 26.4562 23.1938 34.1701 18.9987 23.2920 20.4802 24.0527 13.7346 12.8557 32.4510 27.4243 6.0275 14.0402 5.4119 9.5501 11.7268 9.3449 4.5205 25.6850 14.5869 6.9889 6.1989 3.9895 265.6576
temp: 333.150 k
press: 1.00000 atm
elementType: 46 6 8 6 6 6 6 6 1 1 6 8 8 6 1 1 6 6 1 6 1 1 1 6 6 6 6 1 6 1 6 1 1 11 6 1 1 1 6 1 1 1 6 1 1 6 1 1 6 8 6 1 1 1 8 6 6 6 6 1 1 1 1 1 1 1 1 1 7 6 6 1 6 8 8 1 1 6 6 6 6 1 6 1 6 1 1 8 1
symmnumber: 1
zpe: 1879261.5 jmol-1
zpe.correction: 0.715773 hartree
zpe.thermalcorrener: 0.773960 hartree
zpe.thermalcorrenthalpy: 0.775015 hartree
zpe.thermalcorrgfe: 0.620292 hartree
zpe.sumelectzpe: -2338.899695 hartree
zpe.sumelectthermal: -2338.841508 hartree
zpe.sumelectthermalent: -2338.840453 hartree
zpe.sumelectthermalfe: -2338.995176 hartree
dipole: -3.2274 -2.3018 5.3561
dipole: 6.6635
quadrupole: -269.6057 -291.7691 -272.2160
quadrupole: -15.6724 24.6526 -0.8994
quadrupole: 8.2579 -13.9055 5.6476 -15.6724 24.6526 -0.8994
hfenergy: -2339.6154676 hartree
pointgroup: C01 [X(C36H42N1Na1O8Pd1)]
dipole: -1.2697717 -0.9055786 2.1072343 debye
polarizability: 653.9750354|31.0308628|602.387031|3.3188105|-7.3259795|673.6174499 unknown
InChI: InChI=1/C22H25O3.C14H17NO5.Na.Pd/c1-5-19(23)12-9-17-14-16(3)8-13-20(17)22(4,21(24)25)18-10-6-15(2)7-11-18;1-14(2,3)20-13(19)15-11(12(17)18)8-9-4-6-10(16)7-5-9;;/h6-8,10-11,13-14H,5,9,12H2,1-4H3;4-7,11,16H,8H2,1-3H3;;/q2*-1;2*+1/rC36H42NNaO8Pd/c1-8-26(39)21-36-29-19-23(3)11-18-28(29)35(7,25-14-9-22(2)10-15-25)32-44-38-45-31(41)30(20-24-12-16-27(40)17-13-24)37(33(42)43-34(4,5)6)47(36,45,48-36)46(32)38/h9-19,30,36,40H,8,20-21H2,1-7H3
charge 0 multiplicity 1
89 atoms
Pd 0.67990524 0.76099003 -0.8409764
C  2.70305156 1.68404473 0.95911663
O  1.77856264 1.60706605 1.81138186
C  -1.08037442 -2.89823212 2.81092981
C  -1.68760624 -2.73382184 1.56635155
C  -0.95362027 -0.43727343 1.40299379
C  -0.3561307 -0.63963008 2.66612917
C  -0.39220941 -1.8336947 3.39099658
H  -1.15386547 -3.8591834 3.32758417
H  0.17247639 0.20559146 3.11751957
C  -1.48555338 -1.25909415 -1.69063188
O  -0.92056189 -0.10513691 -1.78651357
O  -1.32713007 -2.12019721 -2.56923559
C  -0.67303393 0.96530244 0.8763687
H  -0.48379835 1.53314137 1.80715655
H  0.67167663 1.27367217 1.03555986
C  -1.65224631 -1.53985026 0.82278439
C  -2.43544085 -1.53490015 -0.50987817
H  -2.22402068 -3.59340134 1.16793205
C  -3.12029897 -2.88140127 -0.80092965
H  -3.64708947 -2.80435152 -1.7618725
H  -2.39200736 -3.70000364 -0.88028076
H  -3.86109828 -3.11654546 -0.02334517
C  -3.58013567 -0.51587107 -0.50434334
C  -4.06715144 0.0131758 -1.70840868
C  -4.2642201 -0.20460826 0.67469788
C  -5.17457704 0.85984748 -1.72412036
H  -3.57655476 -0.2395703 -2.65420711
C  -5.37230274 0.64741296 0.65742273
H  -3.92470776 -0.62339137 1.62633714
C  -5.84215286 1.20476173 -0.53831098
H  -5.52645904 1.2680451 -2.67626137
H  -5.88276056 0.88406422 1.59573942
Na 0.49869775 -1.04465758 -3.50672398
C  0.26766038 -1.93758137 4.73722138
H  -0.26587028 -1.33112709 5.48651236
H  0.285232 -2.9762914 5.09590167
H  1.30333219 -1.56558454 4.7029655
C  -6.98707869 2.17853297 -0.55252403
H  -6.61180297 3.2165644 -0.56091964
H  -7.61221344 2.05495104 -1.44914336
H  -7.62422863 2.06741567 0.33648535
C  -1.70883838 1.87608554 0.21700024
H  -2.62277429 1.9328385 0.83818383
H  -2.0569686 1.54501302 -0.77056151
C  -2.05104475 4.26117585 -0.70848117
H  -1.70630702 5.27333365 -0.44991884
H  -1.77171796 4.09336215 -1.76514733
C  -1.20247509 3.29084851 0.07781147
O  -0.13180229 3.64020447 0.55197988
C  -3.55721654 4.10671817 -0.54460495
H  -4.08654482 4.87653732 -1.12472469
H  -3.89995957 3.12607439 -0.90397028
H  -3.86319616 4.2093554 0.5086004
O  3.94868613 2.00581248 1.27018851
C  4.44233373 2.08773499 2.64386072
C  3.74751771 3.22023298 3.38624225
C  5.91859933 2.40050323 2.4552219
C  4.26699049 0.73916495 3.32886087
H  3.81597042 4.15213321 2.80462605
H  2.69071989 2.9946158 3.57463672
H  4.25053644 3.38007985 4.351543
H  6.4124212 2.48156997 3.43405071
H  6.41113245 1.60247024 1.87906307
H  6.04448501 3.35252213 1.91841897
H  4.7652808 -0.05226823 2.74662355
H  4.73321973 0.77521011 4.32455679
H  3.20588251 0.48179746 3.45351227
N  2.45386694 1.44120148 -0.31944536
C  3.51352063 1.17115406 -1.27783985
C  2.89164316 0.95965008 -2.6510844
H  4.22973091 2.00606202 -1.33426346
C  4.2905471 -0.13339387 -0.94840708
O  1.60977647 0.70845585 -2.64551716
O  3.57397968 0.93551706 -3.6653237
H  5.04247375 -0.27847324 -1.73911115
H  4.82030186 0.0162898 0.00446324
C  3.35611645 -1.30990442 -0.85730202
C  2.99797591 -2.05582859 -1.99164176
C  2.70430245 -1.60506187 0.34806825
C  1.99789798 -3.03086339 -1.93725473
H  3.50710517 -1.85886607 -2.94176026
C  1.70947974 -2.57866542 0.41986479
H  2.97369838 -1.05596857 1.25707062
C  1.33224144 -3.28490729 -0.72818404
H  1.73672684 -3.62668762 -2.8173831
H  1.20666106 -2.79094004 1.36704997
O  0.3633873 -4.22905977 -0.70698852
H  -0.03175637 -4.29018048 0.18011672
