program: Gaussian 16
title: (SMD = 2-propanol)-MN15/BS1
version: ES64L-G16RevC.01
method: RMN15
basis: GenECP
operation: Freq
keyword: #p
keyword: freq=noraman
keyword: mn15/genecp
keyword: scrf=(solvent=2-propanol,smd)
keyword: nosymmguess=read
title: #p freq=noraman mn15/genecp scrf=(solvent=2-propanol,smd) nosymm guess
basis: NPDir=0 NMtPBC= 1 NCelOv= 1 NCel= 1 NClECP= 1 NCelD= 1
basis: NCelK= 1 NCelE2= 1 NClLst= 1 CellRange= 0.0.
basis: One-electron integrals computed using PRISM.
converged: YES YES NO NO
title: Mulliken charges:
elementType: C C C C C C H H H H C C H H H C C C C H C H C H H C H H H C O O C H H H Pd Na O C O C H N C H C H O C O O H H H H C H H C C H C C C C C C H C C H C C H H C H H H H O C O C H H H
charge: -0.027871 -0.033546 0.044425 -0.019495 -0.040689 -0.065222 -0.009926 0.005517 -0.009117 -0.011792 -0.172960 0.080068 0.040860 0.038598 0.020888 0.035513 -0.098423 0.010020 -0.032643 0.280892 -0.023322 -0.009189 -0.045368 0.002952 -0.003082 0.143225 0.036375 0.038411 0.031913 0.230194 -0.357375 -0.277926 0.089701 0.035413 0.023722 0.046799 -0.066513 0.435438 -0.303217 0.184158 -0.369909 0.109121 0.040571 -0.099472 0.006127 0.172123 0.253718 0.030136 -0.337102 0.073151 -0.315233 -0.298778 0.205630 0.035581 0.030256 0.021969 0.264049 0.051949 0.047666 0.089255 -0.097109 0.053106 -0.074808 0.003900 -0.006133 -0.030224 0.074709 0.028144 -0.013826 -0.014547 0.002415 -0.008537 -0.030041 0.059812 -0.007953 -0.039477 0.004301 0.011051 -0.012746 0.018556 0.009976 -0.328484 0.161722 -0.295391 0.085570 0.069993 0.076603 0.041200
chargesum: -0.00000
title: Mulliken charges with hydrogens summed into heavy atoms:
elementType: C C C C C C C C C C C C C C C C O O C Pd Na O C O C N C C O C O O C C C C C C C C C C C C C C O C O C
charge: -0.037797 -0.028029 0.044425 -0.028612 -0.052481 -0.065222 -0.172960 0.180415 0.035513 0.182470 0.000831 -0.029691 -0.026404 -0.045368 0.249924 0.230194 -0.357375 -0.277926 0.195635 -0.066513 0.435438 -0.303217 0.184158 -0.369909 0.149693 0.072651 0.036263 0.253718 -0.131472 0.160957 -0.315233 -0.298778 0.363665 0.142361 -0.097109 -0.074808 -0.009926 -0.006133 -0.038761 0.074709 0.020191 -0.054024 0.013466 -0.042787 0.078368 0.014276 -0.328484 0.161722 -0.295391 0.273367
chargesum: 0.00000
polarizability: 7.23356500e+02 7.26662108e-01 6.56279050e+02 2.77747952e+01 -1.49785055e+02 6.79477843e+02
1716.lowfreq: -1356.0238 -5.4129 -0.0003 0.0004 0.0008 4.8087 8.1448 14.4531 21.2491
frequency: -1356.0238 14.2338 21.1144 25.2010 28.6897 32.2533 39.8143 44.3654 46.4402 48.4235 53.0720 58.3197 61.3863 63.3500 69.0824 74.3870 83.9069 88.7329 94.6870 96.5560 99.0446 104.6342 110.1278 113.9382 126.2846 133.0766 139.8635 146.2180 148.8493 154.4157 165.9037 169.5085 181.6885 185.4104 190.1203 193.6289 215.5026 219.5084 222.8649 242.7010 244.9865 251.7256 258.6779 266.3435 269.1318 282.6402 301.9543 303.9781 308.5593 311.6903 322.9643 329.8735 337.4490 341.9333 366.2576 374.6095 385.0906 388.9251 404.6255 414.1092 420.1652 429.6275 431.1035 433.7074 439.2526 444.8808 453.1075 455.9320 465.5198 475.3780 485.4619 492.9545 512.8702 532.1778 539.2523 553.0407 560.9752 566.4336 581.2674 581.8785 611.9074 613.5044 623.9943 628.0991 630.8969 634.9670 669.9173 679.4192 720.4905 722.7103 735.6137 736.0297 740.5219 759.6080 764.1426 769.5319 776.3828 780.3931 787.9434 788.5820 801.3907 806.4871 812.8381 819.5035 844.9236 855.6278 862.7361 866.8912 869.1952 882.6129 893.9671 910.7572 921.1789 924.4495 925.8238 937.5401 968.6601 977.0438 982.8845 984.3707 988.4473 993.2675 997.8361 1000.8184 1009.9196 1011.9975 1013.8952 1014.7734 1015.6456 1020.8525 1030.9824 1036.1816 1039.2095 1043.8183 1045.6657 1046.0109 1046.6413 1048.5962 1048.7709 1065.9193 1077.2661 1082.7606 1093.1704 1106.8762 1115.5178 1116.7321 1125.7591 1137.5327 1141.3971 1142.9122 1147.0027 1150.4739 1156.8472 1164.2264 1175.5348 1191.5400 1220.5323 1223.6027 1224.7260 1237.1431 1239.2988 1241.3977 1245.9096 1260.0267 1270.3410 1273.8065 1277.4854 1287.1943 1302.2386 1302.9533 1312.0157 1317.5857 1324.0568 1329.7962 1336.7771 1348.0778 1356.6613 1358.7092 1361.2583 1370.3465 1373.5770 1373.6667 1374.6462 1384.5684 1392.4810 1393.5124 1399.4381 1409.5897 1413.3805 1416.3362 1417.0507 1420.2216 1421.7534 1424.1163 1429.1721 1436.2851 1438.8354 1440.7212 1444.0332 1449.9406 1450.6151 1475.2023 1479.7274 1513.1695 1515.0860 1527.7413 1528.7037 1552.1530 1568.4335 1631.6316 1654.0711 1655.4023 1661.5891 1665.5684 1676.0581 1684.4556 1692.3703 1699.0739 1720.1177 1750.7668 1781.9175 3073.4421 3073.7632 3075.8795 3077.8333 3080.4346 3095.5610 3102.0477 3114.9291 3135.9068 3157.0267 3161.1629 3172.2902 3173.5580 3183.1004 3184.6202 3186.9556 3190.9618 3194.1976 3194.6677 3198.9557 3207.5508 3218.3926 3221.5684 3222.1629 3223.1191 3224.4058 3229.4055 3229.5927 3234.1031 3238.0264 3242.6495 3244.2599 3248.3837 3248.8945 3256.4163 3611.7695 3704.6004
redmass: 1.1085 5.0477 5.7243 4.7956 1.1124 3.9132 6.0926 1.5779 4.1547 3.9753 4.6099 4.1773 3.3894 3.8813 3.6725 3.7653 6.8438 3.5153 2.5675 5.4330 4.9144 2.3559 4.3549 4.0498 7.3116 6.0484 6.8408 6.7744 5.9618 4.6175 6.0175 9.3615 5.4806 5.0228 5.3612 5.5521 4.3475 2.3674 2.0363 6.8160 4.5328 4.3239 4.4591 3.6810 4.4661 4.3792 4.4343 4.5115 6.5383 4.7306 5.3875 3.3922 3.9436 4.1930 3.7408 3.6435 1.2458 4.7585 4.0631 5.8515 3.0338 4.8119 2.2394 2.5442 2.4871 3.1948 1.5275 3.7270 2.4647 4.9512 4.0345 4.9609 4.8272 3.2236 4.4849 3.6495 3.8625 4.1848 3.3684 3.9744 6.3626 4.3955 3.6053 2.8132 4.5393 6.6449 6.2790 4.6826 6.2471 6.0559 4.4101 4.1762 4.5365 3.4827 2.4642 1.7257 1.7327 3.0914 5.5622 4.5510 6.7284 2.9400 4.3233 2.2002 2.6580 2.0336 1.6170 3.1824 1.2769 2.7433 2.8095 1.3370 2.1890 1.6861 1.4652 2.2131 2.6826 3.5931 1.4026 2.0085 1.4078 1.3797 1.6206 1.4621 2.8586 1.4743 2.4507 1.5878 2.6722 1.4108 3.0500 1.6349 1.5609 1.4851 1.7064 1.8097 1.6330 1.7015 2.5841 2.7764 1.9345 1.7774 2.6235 1.5746 1.4226 1.3314 1.1448 1.1111 1.1094 2.5144 2.9694 1.2800 1.3095 2.7026 1.0883 1.6859 1.7194 1.9068 2.4589 1.7007 1.8082 2.1259 2.8756 1.2907 1.6842 1.7449 4.1078 1.6917 1.6315 1.2838 1.6125 1.9877 1.6317 1.5097 1.2638 1.6382 1.4459 5.2128 2.1317 4.3616 1.4272 1.4585 1.4095 1.3071 3.0656 1.5179 5.4241 1.0452 1.3253 1.1496 1.3543 1.0452 1.0836 1.3589 1.0796 2.6357 1.2580 1.7858 1.1651 1.4386 2.2063 2.6492 3.0285 3.3600 3.9853 5.4329 4.4828 3.2890 3.2886 6.7212 7.2130 7.2644 7.5044 7.6257 7.0964 7.9872 7.9085 7.3746 12.5517 12.1576 11.2171 1.0388 1.0361 1.0392 1.0484 1.0761 1.0369 1.0857 1.0861 1.0609 1.1030 1.1024 1.1030 1.1040 1.1049 1.1056 1.1053 1.0917 1.1029 1.1058 1.0900 1.1095 1.0913 1.0910 1.0957 1.0876 1.0883 1.0911 1.1086 1.0928 1.0956 1.0978 1.0939 1.1000 1.0937 1.0945 1.0783 1.0680
irintensity: 5333.4151 0.2109 1.1455 0.1885 0.9123 0.7023 1.7336 0.6254 4.0675 0.4268 1.1616 0.8505 0.7716 1.3605 0.5410 0.7489 5.5797 6.2533 1.7175 2.9561 0.7883 0.6802 2.7559 2.4021 3.9477 0.3887 2.2019 17.5565 12.9261 0.3494 5.6691 27.0139 13.5472 4.7778 2.5729 1.2110 0.2885 16.3726 10.1722 36.3763 6.0550 7.2972 2.9518 0.5350 9.8620 32.3733 23.5984 3.7521 3.0910 1.6359 21.7341 5.3029 8.0517 4.3440 6.1193 11.8146 1.2353 27.1231 6.4253 1.5336 5.7801 39.6551 187.1834 54.9501 38.4273 3.0498 154.0950 18.8814 26.8505 38.4542 32.0346 58.1609 1.2725 7.7460 18.3665 35.5926 29.7673 9.7784 4.9330 17.9491 6.4956 19.4768 8.9988 16.9710 6.4548 0.3380 11.8147 68.2341 123.5353 14.7613 11.0755 53.5937 3.9126 25.8609 23.3556 40.1708 95.2450 47.6944 18.9260 9.6722 115.4170 26.9479 16.0459 2.0676 10.0892 32.8474 11.5229 7.6786 1.0938 1.2360 8.3639 2.3840 9.8090 2.7003 50.3576 10.7703 37.3468 41.6490 5.6186 11.9006 6.5632 11.0330 4.8685 1.2631 8.6878 6.5018 16.8074 1.3699 7.8752 1.6310 52.8881 17.6206 3.3903 0.6310 15.3467 10.1778 10.8126 26.4236 26.3607 12.1587 55.7783 38.0907 37.2244 17.9294 15.3352 1.0837 434.2743 0.5580 0.1376 24.5342 36.9395 274.8905 1.2287 83.3980 2.5878 5.7444 21.6224 251.8227 8.7650 2.9534 82.3564 0.1515 10.4180 117.7712 27.3198 27.2973 27.3916 184.6370 7.0471 5.0662 8.8809 18.5035 142.8482 125.6637 7.1580 83.2048 65.2343 12.8050 6.0958 14.9110 33.8126 22.0746 0.6626 85.8727 612.2203 37.0257 1.1584 16.2500 9.7112 6.6460 8.8200 10.7914 12.8241 18.7001 7.8120 475.4690 6.0298 22.0284 42.7219 132.8071 17.8529 39.2950 28.7226 13.1568 160.3268 369.8502 2.1030 51.3025 923.6690 18.8677 4.4171 8.6870 728.1553 5.7110 22.5895 3.2953 1.1136 22.7511 1039.4211 425.2149 725.1049 33.7702 15.2564 27.9024 13.4618 46.6342 0.1725 5.6155 34.1316 30.4491 14.7363 13.5959 37.0323 18.8956 21.1219 19.4284 18.6391 13.5007 0.0306 17.5489 11.8883 10.3918 18.4008 12.5477 16.8060 1.0634 4.1912 1.5293 4.5466 7.0538 16.9109 15.0242 7.4128 19.3958 6.7248 0.8875 165.5967 606.5684
temp: 298.150 k
press: 1.00000 atm
elementType: 6 6 6 6 6 6 1 1 1 1 6 6 1 1 1 6 6 6 6 1 6 1 6 1 1 6 1 1 1 6 8 8 6 1 1 1 46 11 8 6 8 6 1 7 6 1 6 1 8 6 8 8 1 1 1 1 6 1 1 6 6 1 6 6 6 6 6 6 1 6 6 1 6 6 1 1 6 1 1 1 1 8 6 8 6 1 1 1
symmnumber: 1
zpe: 1812868.0 jmol-1
zpe.correction: 0.690485 hartree
zpe.thermalcorrener: 0.738931 hartree
zpe.thermalcorrenthalpy: 0.739876 hartree
zpe.thermalcorrgfe: 0.605879 hartree
zpe.sumelectzpe: -2487.761063 hartree
zpe.sumelectthermal: -2487.712616 hartree
zpe.sumelectthermalent: -2487.711672 hartree
zpe.sumelectthermalfe: -2487.845669 hartree
dipole: -3.0650 3.8119 2.1375
dipole: 5.3380
quadrupole: -241.2956 -288.6664 -291.4250
quadrupole: 0.8227 4.6959 -23.9068
quadrupole: 32.5001 -14.8708 -17.6293 0.8227 4.6959 -23.9068
hfenergy: -2488.4515475 hartree
pointgroup: C01 [X(C38H38N1Na1O9Pd1)]
dipole: -1.2058685 1.4997228 0.8409611 debye
polarizability: 723.3565004|0.7266621|656.2790496|27.7747952|-149.7850549|679.4778426 unknown
InChI: InChI=1/C19H18NO5.C17H17O2.C2H3O2.Na.Pd/c1-11(21)17(18(22)23)20-19(24)25-10-16-14-8-4-2-6-12(14)13-7-3-5-9-15(13)16;1-12-4-8-14(9-5-12)17(3,16(18)19)15-10-6-13(2)7-11-15;1-2(3)4;;/h2-9,11,16-17,20-21H,10H2,1H3;4-11H,1-3H3;1H3;;/q3*-1;+2;+1/rC38H38NNaO9Pd/c1-22-14-17-26(18-15-22)38(5)32-19-16-23(2)20-33(32)50(47-25(4)42)48-35(43)34(24(3)41)39-37(46-40(48)45-36(38)49(40)50)44-21-31-29-12-8-6-10-27(29)28-11-7-9-13-30(28)31/h6-20,24,31,33-34,39,41H,21H2,1-5H3
charge 0 multiplicity 1
88 atoms
C  3.367292 -4.872993 3.045806
C  2.864213 -3.802021 2.315116
C  2.871369 -2.497209 2.838176
C  3.402094 -2.305101 4.114521
C  3.911798 -3.384613 4.846848
C  3.904407 -4.683772 4.33141
H  3.347024 -5.878372 2.614906
H  2.46415 -3.976241 1.30997
H  3.431978 -1.308813 4.559682
H  4.323061 -3.20761 5.844945
C  2.345917 -1.35064 1.973317
C  4.443675 -5.847396 5.116143
H  3.655885 -6.591554 5.313442
H  5.240576 -6.366577 4.561023
H  4.854949 -5.523584 6.082538
C  3.324192 -0.997077 0.847973
C  2.954276 -0.077297 -0.168071
C  4.617617 -1.523384 0.804364
C  3.862133 0.240032 -1.193176
H  2.352698 1.09701 0.124782
C  5.509907 -1.182066 -0.219427
H  4.952707 -2.217467 1.577521
C  5.152028 -0.303287 -1.246626
H  3.55203 0.95872 -1.961241
H  6.514046 -1.616042 -0.213395
C  2.069617 -0.085645 2.802821
H  3.009712 0.35008 3.170372
H  1.426804 -0.325954 3.662395
H  1.561677 0.672105 2.186029
C  0.989021 -1.835015 1.423912
O  0.818327 -1.896773 0.134064
O  0.090711 -2.173487 2.19841
C  6.09642 0.040214 -2.363997
H  6.095375 1.120864 -2.570543
H  7.124651 -0.267976 -2.128323
H  5.800879 -0.466415 -3.296794
Pd 0.957025 -0.09236 -0.717596
Na -1.566528 -1.793599 0.388035
O  -0.219013 -1.21136 -3.205731
C  -1.103556 -0.658636 -2.554116
O  -0.996442 -0.283174 -1.322712
C  -2.369373 -0.220868 -3.283756
H  -2.562814 -0.968252 -4.070186
N  -3.524605 -0.012749 -2.445168
C  -1.99037 1.119134 -3.965836
H  -4.05226 0.852883 -2.553795
C  -3.924561 -0.834763 -1.46381
H  -1.092299 0.894758 -4.569075
O  -1.719551 2.105797 -2.997176
C  -3.078357 1.640642 -4.883084
O  -3.338196 -1.855209 -1.101601
O  -5.075558 -0.413124 -0.912973
H  -0.898517 1.890199 -2.512727
H  -2.726829 2.553027 -5.385265
H  -3.336766 0.894592 -5.647646
H  -3.9902 1.901832 -4.323098
C  -5.458744 -1.001537 0.321911
H  -6.553968 -1.064433 0.312343
H  -5.051719 -2.020561 0.374193
C  -4.975228 -0.167012 1.528173
C  -3.668547 0.575669 1.324599
H  -5.760937 0.560721 1.790969
C  -4.655928 -1.071568 2.698543
C  -3.36626 1.623042 0.451625
C  -2.705564 0.131123 2.254172
C  -5.470896 -2.007098 3.331193
C  -3.310688 -0.919281 3.088331
C  -2.096365 2.210704 0.505098
H  -4.112004 1.989935 -0.257483
C  -1.436402 0.71653 2.306547
C  -4.929499 -2.783511 4.363285
H  -6.51462 -2.134612 3.031603
C  -2.767904 -1.69751 4.114653
C  -1.140414 1.760736 1.42449
H  -1.84847 3.025335 -0.180894
H  -0.704984 0.383189 3.044699
C  -3.591678 -2.631417 4.749284
H  -5.557365 -3.51883 4.872139
H  -1.72097 -1.583174 4.407292
H  -0.157345 2.237371 1.466049
H  -3.187962 -3.250144 5.554133
O  0.871209 1.737564 -1.540072
C  1.383667 2.673578 -0.839758
O  2.112196 2.430587 0.160467
C  1.085513 4.085991 -1.229887
H  0.657346 4.609893 -0.363025
H  2.025739 4.59347 -1.489996
H  0.390082 4.118385 -2.07664
