program: Gaussian 16
title: MN15/BS1
version: ES64L-G16RevC.01
method: RMN15
basis: GenECP
operation: Freq
keyword: #N
keyword: Geom=AllCheck
keyword: Guess=TCheck
keyword: SCRF=Check
keyword: GenChk
keyword: RMN15/GenECP
keyword: Freq
converged: YES YES NO NO
title: Mulliken charges:
elementType: C C C C C C H H H H C C H H H C C C C C H C H H C H H H C O O C H H H Pd Na C H C H H O C O N H C H C O O C H O C H H H C H H H C H H C C C C H C H C H H O H C C C C H H H H H H H H H
charge: 0.005532 0.030104 0.047950 -0.010857 -0.008181 -0.048832 -0.047273 -0.060022 -0.034599 -0.041527 -0.150256 0.084490 0.027407 0.027025 0.006917 0.000217 0.187262 -0.011510 -0.042913 -0.006564 -0.030590 -0.050807 -0.027447 -0.045319 0.182627 -0.003436 0.014498 0.034187 0.189707 -0.319100 -0.296540 0.102426 0.003833 0.016189 0.022705 -0.712376 0.571561 -0.077897 0.066942 0.291782 0.037911 0.038666 -0.275399 0.275170 -0.239195 -0.135106 0.145242 0.057695 0.018349 0.170526 -0.313032 -0.324360 0.133366 0.045000 -0.272353 0.051700 0.204424 -0.004290 0.022696 0.013149 0.013513 -0.021587 0.012813 0.177939 0.003408 0.005675 -0.071068 -0.001349 0.029420 -0.032635 -0.026431 0.003331 -0.016838 0.134726 -0.044798 -0.019193 -0.185859 0.184678 -0.164532 0.096466 0.070037 0.092976 0.010098 0.010562 0.034702 0.084481 0.034421 0.003068 0.011878 0.016881 0.015747
chargesum: -0.00000
title: Mulliken charges with hydrogens summed into heavy atoms:
elementType: C C C C C C C C C C C C C C C C O O C Pd Na C C O C O N C C O O C O C C C C C C C C C O C C C C
charge: -0.041741 -0.029918 0.047950 -0.045457 -0.049708 -0.048832 -0.150256 0.145839 0.000217 0.187262 -0.042100 -0.070360 -0.051883 -0.050807 0.227877 0.189707 -0.319100 -0.296540 0.145153 -0.712376 0.571561 -0.010956 0.368358 -0.275399 0.275170 -0.239195 0.010137 0.076044 0.170526 -0.313032 -0.324360 0.178366 -0.067928 0.070106 0.017889 0.187022 -0.071068 -0.027779 0.012582 -0.077433 -0.015863 0.134726 -0.001181 -0.164532 0.151828 0.192007 0.137482
1716.lowfreq: -4.4419 -0.0007 -0.0005 0.0005 3.1791 5.3957 19.6453 27.5324 31.3327
redmass: 6.1074 5.3112 4.3646 2.7118 1.3248 4.6802 6.1545 1.7846 1.7301 5.0118 3.3561 4.4537 4.9083 3.6247 4.2529 5.8460 5.5544 5.2213 4.1383 5.9031 4.1075 2.9204 4.3885 3.2383 5.7028 4.4744 7.4874 4.8447 5.3123 5.4165 4.5462 5.6001 5.3207 3.7486 3.3641 1.6914 4.7732 2.1187 3.0111 1.5479 1.8266 4.5007 3.7499 3.9101 1.1345 4.2516 2.8964 3.8051 3.0525 2.9088 3.4251 3.2406 2.2465 2.2343 3.5268 2.8245 2.6291 4.1674 3.4150 6.3017 3.9953 1.4690 2.3061 4.0615 3.7182 3.2062 2.8434 2.9535 2.9005 4.6875 4.5026 2.9460 4.1196 3.2669 4.1970 4.5351 1.4172 2.1113 1.5744 3.3138 2.7582 3.9402 2.3274 3.3904 3.4420 4.1654 6.3615 6.6569 6.8704 4.1220 4.4113 3.4626 3.3873 1.2830 2.7804 4.5881 3.0349 3.9699 1.5421 3.2016 7.4234 3.7948 3.7726 1.4900 2.4101 1.3510 2.6124 1.7027 1.7385 1.2967 4.1715 3.1018 3.3505 1.3840 2.6993 1.4676 2.3391 1.4886 1.5199 1.2115 1.3136 1.3189 1.3970 1.4190 1.3852 1.3919 1.6783 1.4027 1.7280 2.3325 2.7845 1.3905 1.4225 1.5540 1.6253 1.5170 1.6442 1.6256 1.4827 2.0082 2.3857 2.0720 1.7216 2.2615 1.8939 1.3151 1.3692 1.4882 2.3429 1.1099 1.2437 2.5230 2.1330 2.4290 1.1038 2.2681 1.3103 1.6222 1.9837 1.5139 2.0986 1.2879 3.6383 2.1809 1.6959 1.7357 2.9262 2.2084 1.6154 1.4206 1.3314 1.4783 1.5612 1.3030 4.5699 7.7504 1.3838 5.2318 1.5012 1.5161 1.3920 1.3569 1.3879 5.4233 1.2948 2.0525 1.5334 1.5453 1.3144 1.6823 2.2175 1.1405 1.4101 1.0583 1.1454 1.1224 1.0759 1.0416 1.0908 1.1477 1.1476 1.1323 1.0366 1.3381 1.1014 1.9077 1.0792 3.4242 6.6298 3.9564 3.2424 4.0214 3.4684 3.9450 7.1371 7.2597 7.1259 7.8109 11.3563 7.2541 7.3739 11.1818 11.2240 1.0850 1.0388 1.0383 1.0378 1.0380 1.0371 1.0369 1.0374 1.0642 1.0604 1.1021 1.0926 1.0608 1.1020 1.1027 1.0999 1.1027 1.1042 1.1041 1.0936 1.1003 1.1040 1.1040 1.1051 1.1037 1.1048 1.0879 1.1032 1.1027 1.1032 1.0904 1.0891 1.0900 1.0969 1.0909 1.0909 1.0964 1.0929 1.0953 1.0930 1.1149 1.0778 1.0673 1.0660
irintensity: 0.1168 0.0225 0.0800 0.0898 0.4333 0.1357 0.0644 0.3795 0.8739 2.4009 1.2917 1.3368 0.1823 0.2821 1.5583 3.9696 0.4785 1.7877 0.0947 0.6736 4.9401 6.6691 1.8740 1.7932 2.4789 7.1856 7.7538 4.0932 4.7464 2.6334 0.2641 1.1135 1.0319 2.3763 14.0388 3.7216 8.9107 6.8677 0.8297 0.8286 3.7624 6.2362 1.9967 3.4831 0.5054 4.9607 3.5336 4.5477 10.8047 7.7504 6.5131 9.1091 0.4841 9.7748 20.6826 1.6675 13.4203 42.2242 0.3673 21.6796 41.0145 85.3748 51.2590 5.7056 29.7220 6.0394 0.1674 3.2078 8.8445 1.9481 1.1785 3.7275 4.4423 16.5900 16.9079 12.9948 90.3052 52.0235 54.7827 2.8175 25.9868 8.7172 54.1366 12.0954 1.1967 10.4962 0.9843 0.3973 1.0673 9.8522 16.6811 3.2680 7.7352 8.0014 2.6244 3.4873 14.7497 1.9067 8.1737 15.0495 17.2627 7.8883 22.8427 6.4494 1.1272 14.2901 13.7279 11.9456 26.3461 0.8329 11.0976 12.4864 8.7105 7.0267 14.6710 5.5206 7.7210 1.1954 1.8110 0.2082 4.5131 4.9773 2.7754 2.4234 2.6015 4.4268 1.1782 6.7618 2.1397 0.5865 12.6537 0.3459 0.6152 0.9040 11.9801 3.5538 4.4298 2.4617 41.3716 4.3548 3.8598 39.6036 9.2661 6.3958 1.9616 5.9084 1.6827 1.3217 1.3835 11.1107 179.7839 14.4810 21.5721 16.3787 3.0452 130.1306 24.3002 10.4376 5.3569 7.5810 5.3361 6.9048 4.4356 6.6117 30.5022 11.5664 6.0789 28.5366 21.8211 5.7275 1.6696 88.8828 42.1876 0.2289 42.6550 8.6084 6.8768 5.7973 26.7668 45.5229 1.0608 1.8546 1.1554 26.6140 24.1067 94.3241 5.2248 27.7402 57.5964 82.0837 72.4112 1.0202 15.2185 1.8294 2.5776 17.9408 7.1527 6.2799 0.8053 1.4919 70.4090 5.4366 7.2110 8.1097 5.4887 6.0945 15.4534 12.7179 187.2131 24.2073 21.1737 829.5562 0.3827 51.6020 24.9387 1.8787 6.2724 99.5509 351.3117 10.8136 57.8741 425.5328 675.9662 15.9244 33.6267 38.1468 16.9222 12.7209 8.4630 21.9677 17.1863 20.1233 24.0376 4.6481 3.6068 0.9802 13.5195 11.3760 8.2464 34.2813 8.7480 12.8652 2.4595 24.1185 13.1520 12.7959 17.3719 6.1142 17.9996 13.0565 8.2608 1.2311 3.7752 14.9485 13.7758 2.4127 8.1864 19.5718 2.7924 16.0634 0.1768 2.8964 4.7551 1.0276 64.9119 162.8569 82.6115
temp: 333.150 k
press: 1.00000 atm
elementType: 6 6 6 6 6 6 1 1 1 1 6 6 1 1 1 6 6 6 6 6 1 6 1 1 6 1 1 1 6 8 8 6 1 1 1 46 11 6 1 6 1 1 8 6 8 7 1 6 1 6 8 8 6 1 8 6 1 1 1 6 1 1 1 6 1 1 6 6 6 6 1 6 1 6 1 1 8 1 6 6 6 6 1 1 1 1 1 1 1 1 1
symmnumber: 1
zpe: 1951732.0 jmol-1
zpe.correction: 0.743375 hartree
zpe.thermalcorrener: 0.804328 hartree
zpe.thermalcorrenthalpy: 0.805383 hartree
zpe.thermalcorrgfe: 0.642204 hartree
zpe.sumelectzpe: -2340.059370 hartree
zpe.sumelectthermal: -2339.998417 hartree
zpe.sumelectthermalent: -2339.997362 hartree
zpe.sumelectthermalfe: -2340.160541 hartree
dipole: -0.4140 3.5092 0.7201
dipole: 3.6062
quadrupole: -274.6982 -290.8639 -276.5965
quadrupole: 3.0252 -14.2638 -0.5132
quadrupole: 6.0213 -10.1444 4.1231 3.0252 -14.2638 -0.5132
hfenergy: -2340.8027454 hartree
pointgroup: C01[X(C36H44N1Na1O8Pd1)]
dipole: -0.1736231 1.4016177 0.1350866 debye
polarizability: 519.5664358|21.1635698|437.6636258|-29.0151922|6.4226811|406.1885736 unknown
InChI: InChI=1/C17H16O2.C14H18NO5.C5H10O.Na.Pd/c1-12-4-8-14(9-5-12)17(3,16(18)19)15-10-6-13(2)7-11-15;1-14(2,3)20-13(19)15-11(12(17)18)8-9-4-6-10(16)7-5-9;1-3-5(6)4-2;;/h4-10H,1-3H3;4-7,11,15-16H,8H2,1-3H3;3,5-6H,1,4H2,2H3;;/q2*-1;;+2;/rC36H44NNaO8Pd/c1-8-28(40)30-21-47(30)29-19-23(3)11-18-27(29)35(7,25-14-9-22(2)10-15-25)32-43-38(45(32)47)36(44-38,46(38)47)31(37-33(41)42-34(4,5)6)20-24-12-16-26(39)17-13-24/h9-19,28,30-31,37,39-40H,8,20-21H2,1-7H3
charge 0 multiplicity 1
91 atoms
C  5.33603009 -0.64015837 -2.01799081
C  4.15990601 -0.65929278 -1.27730224
C  3.7270331 -1.83129031 -0.63374645
C  4.51301567 -2.9776494 -0.76254122
C  5.69821491 -2.9527357 -1.50618164
C  6.13212921 -1.79017998 -2.14663508
H  5.64977022 0.28708451 -2.50697119
H  3.55428102 0.24438994 -1.1788836
H  4.21173389 -3.91024248 -0.28367841
H  6.2974607 -3.864091 -1.5887227
C  2.41362839 -1.80202632 0.15927168
C  7.40571397 -1.75901637 -2.94817942
H  7.21051431 -1.48469172 -3.99650085
H  8.11160794 -1.01519299 -2.54724837
H  7.90654518 -2.73703885 -2.9429431
C  2.43223706 -0.69535766 1.21399508
C  1.27933183 0.01957924 1.58719013
C  3.62120148 -0.40383501 1.89481085
C  1.34032642 1.01164942 2.56681288
C  3.67911721 0.57931565 2.88351137
H  4.52920969 -0.95188551 1.6265539
C  2.54101486 1.31388224 3.22792003
H  0.45073928 1.6079219 2.79179845
H  4.62801155 0.78637009 3.38608909
C  2.11382624 -3.13780572 0.84296945
H  2.89741509 -3.37275492 1.57871933
H  1.14572438 -3.08287418 1.35974481
H  2.04130815 -3.94482789 0.10145183
C  1.34930205 -1.54103645 -0.92083656
O  1.0085209 -0.31430884 -1.15846367
O  0.89073499 -2.49708199 -1.5755841
C  2.58809168 2.41614002 4.2525597
H  3.58131248 2.49062121 4.71681514
H  2.35615451 3.39084763 3.79354755
H  1.84974071 2.2535596 5.0524699
Pd -0.32930401 -0.14208668 0.48355304
Na -0.55608541 -1.20128865 -2.77660566
C  -1.26856835 -1.47628838 1.8929999
H  -0.47377042 -1.85390787 2.54978971
C  -1.73432904 -0.17595507 2.06819131
H  -2.6913539 0.10973551 1.61291199
H  -1.35587205 0.45009922 2.87894367
O  0.4666047 3.89276214 -1.26835852
C  -0.39692449 3.02768391 -0.75054243
O  -0.19580265 2.36072914 0.2592671
N  -1.56406302 2.9746718 -1.44935898
H  -1.56773876 3.35482925 -2.39254358
C  -2.51524946 1.93638695 -1.10593826
H  -2.46893967 1.80533566 -0.01538835
C  -2.10830836 0.61581246 -1.7674724
O  -1.99863007 0.59048212 -3.00475839
O  -1.88560791 -0.39397059 -1.01174248
C  -2.05136425 -2.54587784 1.16483089
H  -2.7825752 -2.04651933 0.49739152
O  -1.20916521 -3.41772248 0.45894431
C  -2.81391912 -3.40694244 2.17469923
H  -0.66453877 -2.93866344 -0.19064186
H  -2.10078601 -3.7549348 2.94111234
H  -3.1350293 -4.30357668 1.62240964
C  -4.01106024 -2.71715411 2.810347
H  -3.72564169 -1.77909461 3.31302329
H  -4.76840808 -2.47571841 2.04906711
H  -4.48567233 -3.36390274 3.56265567
C  -3.95284275 2.26772043 -1.50770204
H  -4.00519124 2.34401914 -2.60575865
H  -4.23155533 3.24071554 -1.07408633
C  -4.84549445 1.15952498 -1.00687093
C  -5.21633157 1.10850675 0.34191051
C  -5.18402193 0.07390577 -1.82516044
C  -5.89832779 0.01008412 0.86319651
H  -4.9554449 1.94054691 1.00403134
C  -5.86966043 -1.02817058 -1.31959687
H  -4.87775884 0.08643554 -2.87513473
C  -6.2255917 -1.0678589 0.03229863
H  -6.17772393 -0.01801807 1.92142426
H  -6.13099569 -1.87741148 -1.9532409
O  -6.87150028 -2.16642229 0.49417002
H  -7.0645155 -2.06645181 1.43661483
C  1.80396085 4.05631092 -0.71026574
C  1.7229854 4.57906975 0.72024168
C  2.5721676 2.74193728 -0.7885848
C  2.42462677 5.10073081 -1.6276173
H  2.73344272 4.85355066 1.0589306
H  1.08819118 5.47701606 0.76488061
H  1.32196193 3.81231939 1.39595527
H  2.17555384 1.99250506 -0.08999725
H  2.51847597 2.33243804 -1.80920084
H  3.62900545 2.92518193 -0.54133331
H  3.4527243 5.32000331 -1.30635188
H  2.44913704 4.73178036 -2.66310556
H  1.83873518 6.03097132 -1.60076225
