program: Gaussian 16
title: MN15/BS1
version: ES64L-G16RevC.01
method: RMN15
basis: GenECP
operation: Freq
keyword: #N
keyword: Geom=AllCheck
keyword: Guess=TCheck
keyword: SCRF=Check
keyword: GenChk
keyword: RMN15/GenECP
keyword: Freq
converged: YES YES YES YES
title: Mulliken charges:
elementType: C C C C C C H H H H C C H H H C C C C C H C H H C H H H C O O C H H H Pd Na C H C H H C O O C H O C H H H C H H H C H N C H C H O C O O H H H H C H H C C H C C C C C C H C C H C C H H C H H H H
charge: -0.011677 -0.019467 -0.000567 0.111460 0.022130 -0.050887 -0.041986 -0.031713 -0.037378 -0.032730 -0.239012 0.094794 0.020217 0.000694 0.036904 0.074795 -0.094234 -0.025233 -0.010907 -0.007361 -0.035664 -0.035879 -0.028383 -0.039228 0.170891 0.029301 0.016215 -0.000171 0.225841 -0.348271 -0.300127 0.095162 0.011864 0.034412 0.020201 -0.393846 0.460202 0.009255 0.006875 0.226930 0.064192 0.072668 0.190705 -0.272523 -0.360147 0.118594 0.005731 -0.296153 0.027537 0.222666 -0.012514 -0.003450 0.045071 -0.005246 0.024511 0.005911 0.080929 0.032342 -0.103894 0.019534 0.154764 0.269837 0.021690 -0.304056 0.081103 -0.297822 -0.286495 0.231213 0.029125 0.010342 0.024936 0.229137 0.043079 0.024340 0.073206 -0.070032 0.029940 -0.042493 -0.001771 0.083875 -0.021194 0.083602 0.077567 -0.043500 -0.020068 0.017830 -0.043575 -0.028970 0.063605 0.011498 -0.046046 0.025343 -0.018508 -0.038755 -0.044609 -0.018021
chargesum: -0.00000
title: Mulliken charges with hydrogens summed into heavy atoms:
elementType: C C C C C C C C C C C C C C C C O O C Pd Na C C C O O C O C C C N C C O C O O C C C C C C C C C C C C C C
charge: -0.053663 -0.051180 -0.000567 0.074082 -0.010600 -0.050887 -0.239012 0.152609 0.074795 -0.094234 -0.060897 -0.039291 -0.046588 -0.035879 0.216236 0.225841 -0.348271 -0.300127 0.161639 -0.393846 0.460202 0.016130 0.363791 0.190705 -0.272523 -0.360147 0.124325 -0.073487 0.011573 0.070247 0.113271 0.050870 0.041223 0.269837 -0.072844 0.145506 -0.297822 -0.286495 0.296556 0.103146 -0.070032 -0.042493 -0.045271 0.083875 -0.064769 0.083602 0.089065 -0.066114 -0.000678 -0.067725 0.018995 0.007322
1716.lowfreq: -315.0148 -5.3161 -4.5065 -1.3740 0.0006 0.0006 0.0010 12.4206 20.5404
redmass: 7.0227 5.1706 5.1108 4.8430 5.0518 4.9133 4.9794 5.0926 3.8463 3.9692 4.6196 2.3332 2.2615 5.8114 5.3413 3.7911 5.2606 5.5286 4.0514 1.2271 3.9523 3.2297 2.9081 4.6178 5.0517 5.4302 5.1541 5.2571 5.9797 5.1637 5.6950 9.3992 4.0596 5.5752 5.3369 4.2274 4.2604 3.4110 4.0762 3.8517 2.4961 2.5712 4.0980 3.4338 3.8400 1.6652 3.2935 3.4524 4.9426 5.7358 4.6210 2.0832 4.4125 3.6081 3.8586 2.5024 1.8758 3.2815 4.0297 4.2354 4.7602 3.8366 4.3618 3.2271 6.1701 3.7900 3.3542 4.0093 4.4635 3.0775 3.7058 3.6515 3.1138 3.9899 4.7023 4.0784 1.2436 3.2981 3.8528 4.1030 4.7296 3.9499 3.3415 3.6751 2.9268 6.8041 4.4575 6.2537 1.9010 6.6882 2.3590 4.2124 1.8422 1.2879 3.3475 3.2414 4.6696 3.5571 4.9865 1.5317 1.4568 1.3718 3.1134 2.9078 9.1024 3.0031 3.0031 3.0889 3.4749 1.8097 1.8922 1.8257 3.4429 1.3801 2.6963 2.6837 1.8245 2.1331 1.6336 1.5656 1.9429 1.4117 1.4742 2.5931 1.3785 2.0338 2.2127 1.3918 2.3854 1.4685 1.4921 1.4485 1.3847 1.4005 3.4371 1.5293 2.7229 3.5987 2.8833 1.6044 1.4657 1.3569 1.6158 1.6144 1.8339 1.8801 2.0874 1.6767 1.8603 1.9825 1.4725 2.1649 1.7981 1.7663 1.4828 1.3223 1.3551 2.2843 1.5144 1.3040 1.1155 1.2614 1.6800 2.1227 1.8312 1.0997 2.0112 2.2404 2.2004 1.6443 1.5691 2.0250 1.8083 1.2653 4.4472 1.7240 2.2400 1.3427 1.2437 2.0886 1.3444 1.3185 2.5209 2.2437 2.5170 1.3798 1.8154 3.5501 1.3327 1.4470 1.6492 4.6280 1.8574 1.3137 1.4880 1.4674 3.7852 1.5820 1.4059 1.4285 3.7769 2.6868 1.1596 1.0718 1.1057 1.4567 1.1416 1.2078 1.0547 1.5662 1.0490 1.3569 1.5551 1.5710 1.1024 1.2368 1.1873 1.8390 1.5226 2.7333 3.9508 4.3421 3.8900 3.3689 4.6110 3.3087 3.3221 6.6702 7.3456 7.2602 7.7516 7.3590 8.0258 7.7432 7.2915 11.6666 11.7991 11.0826 1.0831 1.0402 1.0616 1.0379 1.0394 1.0839 1.0375 1.0813 1.0419 1.0627 1.0997 1.0857 1.0906 1.1003 1.1027 1.1029 1.0581 1.1039 1.1064 1.1047 1.1045 1.1037 1.0900 1.1046 1.1044 1.0922 1.0984 1.0895 1.0894 1.0905 1.0910 1.0962 1.0895 1.0896 1.0945 1.0942 1.0932 1.0994 1.0961 1.0921 1.1134 1.0691 1.0782 1.0651
irintensity: 17.7188 0.1166 0.3087 0.0651 0.9666 0.2054 0.0142 1.3049 0.4446 0.5853 0.0570 0.3093 1.3360 0.8149 1.4562 0.3436 2.0200 0.3933 0.7389 0.1800 2.3631 0.9195 0.0340 4.9166 3.0190 3.1235 3.1923 2.1285 0.4754 2.3201 5.4292 1.7612 1.1283 3.4525 0.5933 3.5873 0.6570 1.5536 5.3210 14.1059 0.8399 2.5201 9.4085 3.7902 0.9073 1.9624 16.6644 4.0761 3.9011 3.7409 4.0768 4.1427 14.5213 0.3300 3.2286 6.9224 2.4328 5.9993 33.3784 4.5376 10.5323 8.0386 21.0623 5.9098 1.2314 2.1797 8.2798 4.5181 28.1552 1.6064 1.9776 5.3089 7.9500 4.5191 0.0124 1.0412 65.9527 0.8402 0.3293 7.2096 8.3576 10.5535 0.0992 15.6560 0.2339 8.0138 12.0565 1.7674 119.0017 4.3272 8.9049 8.4742 88.3546 154.3085 2.5867 7.5953 0.1488 10.1671 9.1708 1.6434 69.1191 5.2178 10.9592 24.9188 39.0272 6.9229 19.3115 5.7194 30.3495 24.3748 5.1466 4.2634 4.4371 3.1512 3.0370 0.4532 2.0288 8.7644 0.6567 1.5972 10.7426 29.7968 8.7915 18.3995 1.2488 1.8759 4.2117 2.1081 2.1198 2.5326 2.2099 0.2741 3.2184 1.9398 2.7637 18.6517 5.8691 9.1854 6.9837 12.8533 5.4519 0.0041 4.1623 12.2240 6.0389 1.6492 1.7881 0.6494 1.3658 8.5056 2.3676 9.4188 9.8988 19.9723 3.6890 9.8809 0.4730 36.7413 3.7984 0.7821 0.1539 1.0436 4.5632 17.0026 6.3557 0.2116 28.7001 12.4482 5.4219 1.5598 4.1105 1.0898 1.5599 5.1137 2.3722 17.8561 0.7173 77.0440 4.8494 3.5523 26.1057 1.6134 3.0177 194.3675 1.3955 10.6183 151.5376 6.7669 22.9240 14.6468 53.2777 5.9934 5.5547 8.8473 1.4300 1.9782 24.7181 0.4251 0.5582 10.8073 1.3709 1.3720 12.5882 4.9286 3.9752 8.7488 11.1496 6.1954 4.4429 8.5020 2.4739 29.3132 116.4913 114.8020 15.2687 1.9265 8.9223 18.1993 39.4360 26.1716 71.1898 169.1215 33.8289 5.7774 2.7581 26.5939 508.6812 5.1306 0.3626 0.6291 0.4510 16.6973 2.5289 5.0525 4.9133 323.4704 705.1313 235.0931 39.5806 20.9212 28.5456 30.8944 33.0769 4.6600 15.2944 15.7233 17.9045 41.3318 5.2316 8.4667 31.5004 14.0934 10.3938 34.0925 8.1824 14.1935 4.7585 18.4167 10.9300 13.8212 8.5341 11.0727 10.9884 3.2620 12.8879 8.6599 9.7203 9.0593 11.8561 15.8445 4.1804 0.9525 2.0112 16.4678 5.3688 24.4942 10.2133 7.7061 7.5282 534.9927 54.0228 210.1873
temp: 333.150 k
press: 1.00000 atm
elementType: 6 6 6 6 6 6 1 1 1 1 6 6 1 1 1 6 6 6 6 6 1 6 1 1 6 1 1 1 6 8 8 6 1 1 1 46 11 6 1 6 1 1 6 8 8 6 1 8 6 1 1 1 6 1 1 1 6 1 7 6 1 6 1 8 6 8 8 1 1 1 1 6 1 1 6 6 1 6 6 6 6 6 6 1 6 6 1 6 6 1 1 6 1 1 1 1
symmnumber: 1
zpe: 2044231.4 jmol-1
zpe.correction: 0.778607 hartree
zpe.thermalcorrener: 0.839957 hartree
zpe.thermalcorrenthalpy: 0.841012 hartree
zpe.thermalcorrgfe: 0.677529 hartree
zpe.sumelectzpe: -2530.175582 hartree
zpe.sumelectthermal: -2530.114232 hartree
zpe.sumelectthermalent: -2530.113177 hartree
zpe.sumelectthermalfe: -2530.276659 hartree
dipole: 4.5565 0.0942 0.5862
dipole: 4.5950
quadrupole: -303.9658 -298.4496 -312.9364
quadrupole: 18.2949 -6.9199 -1.9917
quadrupole: 1.1515 6.6676 -7.8191 18.2949 -6.9199 -1.9917
hfenergy: -2530.9541884 hartree
pointgroup: C01 [X(C41H44N1Na1O8Pd1)]
dipole: -1.7862119 -0.0453261 0.2748876 debye
polarizability: 573.1482864|15.2287378|473.3604401|-11.9627227|-11.5539897|467.1812317 unknown
InChI: InChI=1/C19H18NO5.C17H16O2.C5H10O.Na.Pd/c1-11(21)17(18(22)23)20-19(24)25-10-16-14-8-4-2-6-12(14)13-7-3-5-9-15(13)16;1-12-4-8-14(9-5-12)17(3,16(18)19)15-10-6-13(2)7-11-15;1-3-5(6)4-2;;/h2-9,11,16-17,20-21H,10H2,1H3;4-10H,1-3H3;3,5-6H,1,4H2,2H3;;/q-2;-1;;+2;+1/rC41H44NNaO8Pd/c1-6-34(44)36-23-52(36)35-21-25(3)17-20-33(35)40(5,27-18-15-24(2)16-19-27)41-43(50-41,51(41)52)47-26(4)37(38(45)49-52)42-39(48-43)46-22-32-30-13-9-7-11-28(30)29-12-8-10-14-31(29)32/h7-21,26,32,34,36-37,42,44,47H,6,22-23H2,1-5H3
charge 0 multiplicity 1
96 atoms
C  5.95192502 -0.20440453 -0.13475739
C  5.09437126 0.62301663 -0.86011863
C  3.87527267 0.13853534 -1.34969757
C  3.56559085 -1.2079183 -1.13750602
C  4.42241552 -2.03120562 -0.41071649
C  5.6192486 -1.54091707 0.12412159
H  6.88783575 0.20029177 0.26130726
H  5.35456168 1.67513973 -1.01284228
H  2.62062683 -1.6153293 -1.50139367
H  4.12905839 -3.06676244 -0.21628868
C  2.93281442 1.09803185 -2.07241326
C  6.47556942 -2.41734447 0.99547976
H  6.69549478 -3.37977914 0.50960802
H  7.42926187 -1.93285417 1.2474368
H  5.94368648 -2.63917041 1.93443615
C  2.53472649 2.25852482 -1.15342525
C  2.13519325 2.08597314 0.19712486
C  2.39812515 3.54439581 -1.69662567
C  1.60975158 3.18031195 0.90455219
C  1.85973716 4.61431263 -0.98118395
H  2.69500678 3.71604025 -2.73185448
C  1.43308174 4.44488827 0.33884033
H  1.33866831 3.03803767 1.95655395
H  1.76517954 5.59168626 -1.4621267
C  3.62315386 1.55090272 -3.36655921
H  3.95052501 0.660746 -3.91730841
H  2.93579045 2.10071965 -4.02418321
H  4.49716966 2.18128926 -3.14536836
C  1.64530624 0.33935981 -2.47240545
O  0.70564763 0.22762283 -1.60784528
O  1.55978539 -0.16668358 -3.6025336
C  0.77940542 5.55404702 1.11658244
H  1.00702752 6.53867943 0.68502814
H  -0.31691169 5.43413442 1.11026753
H  1.10103802 5.55452678 2.16843358
Pd 1.07003502 0.3474833 0.49256608
Na -0.33951115 -1.33352087 -2.93711631
C  1.81016481 0.39635536 2.36683744
H  1.25311879 1.08424286 3.02092835
C  2.89841297 0.95854826 1.58541827
H  3.39909507 1.86169227 1.93710226
H  3.60047979 0.20647837 1.21320709
C  -0.12210452 -2.28004507 0.33332773
O  -0.44806723 -1.10526299 0.6456654
O  1.03881012 -2.7414862 0.24966941
C  1.97115265 -0.99373009 2.96913431
H  0.95376882 -1.42264557 3.09551907
O  2.76661501 -1.82757166 2.17985599
C  2.62023885 -0.90256791 4.35161866
H  2.24209773 -2.13010282 1.40332843
H  2.04583477 -0.19555802 4.97286061
H  3.6241407 -0.46417548 4.2129889
C  2.72357964 -2.26053175 5.02949143
H  1.72381763 -2.68885164 5.20522563
H  3.27498677 -2.95677018 4.38296283
H  3.23849619 -2.1959187 5.99903576
C  -1.24710088 -3.28495492 0.01681274
H  -1.28371941 -3.95064746 0.89308047
N  -2.57202944 -2.71079319 -0.07995971
C  -0.7834724 -4.18026152 -1.16892015
H  -3.17187993 -2.74078499 0.73870819
C  -2.99334005 -1.88378117 -1.05921721
H  -0.16531026 -4.96854591 -0.70745737
O  0.04164298 -3.47825135 -2.08510491
C  -1.92481603 -4.83204907 -1.91972721
O  -2.36570654 -1.60332014 -2.07288656
O  -4.23755946 -1.45409399 -0.81644315
H  0.86166897 -3.3067634 -1.57718917
H  -1.52467757 -5.54915835 -2.64903184
H  -2.59267289 -5.36464323 -1.22778895
H  -2.51054099 -4.07685746 -2.46194134
C  -4.84086897 -0.53986454 -1.72014701
H  -4.18549441 -0.40470527 -2.59223375
H  -5.78972766 -0.98669278 -2.05541108
C  -5.09101367 0.78327877 -1.00701366
C  -3.82997838 1.36377144 -0.40181547
H  -5.5278705 1.47861294 -1.74633089
C  -6.00166634 0.65039197 0.19549041
C  -2.62451966 1.68204201 -1.02035919
C  -3.99581732 1.54479714 0.98339582
C  -7.30083975 0.15816916 0.2617216
C  -5.34605854 1.09985921 1.35552281
C  -1.58629178 2.21216046 -0.24637795
H  -2.48066924 1.52208065 -2.09264014
C  -2.95985604 2.06724586 1.75826511
C  -7.94888853 0.12243702 1.5018054
H  -7.81362181 -0.19480967 -0.6378077
C  -5.99276115 1.06609104 2.5926008
C  -1.75853167 2.40259061 1.13076924
H  -0.63307556 2.46724063 -0.71726481
H  -3.08379425 2.21050533 2.83468416
C  -7.29882285 0.57417157 2.65592415
H  -8.96988165 -0.25950898 1.56996967
H  -5.48670021 1.41620994 3.49583858
H  -0.93483441 2.80841167 1.72122789
H  -7.81889561 0.54073183 3.61596569
