program: Gaussian 16
title: MN15/BS1
version: ES64L-G16RevC.01
method: RMN15
basis: GenECP
operation: Freq
keyword: #N
keyword: Geom=AllCheck
keyword: Guess=TCheck
keyword: SCRF=Check
keyword: GenChk
keyword: RMN15/GenECP
keyword: Freq
converged: YES YES NO YES
title: Mulliken charges:
elementType: Pd C O C C C C C H H C O O C H H C C H C H H H C C C C H C H C H H Na C H H H C H H H C H H C H H C O C H H H O C C C C H H H H H H H H H N C C H C O O H H C C C C H C H C H H O H
charge: -0.500776 0.192139 -0.251449 -0.000058 0.018609 0.122535 -0.004430 -0.060291 0.012399 -0.032511 0.184533 -0.272297 -0.338164 0.021118 0.023231 0.199403 0.066508 -0.288004 -0.017438 0.204385 0.032966 -0.007650 0.007117 0.039400 0.017816 -0.001396 -0.012217 -0.007797 -0.005713 -0.030496 -0.051971 -0.037237 -0.039973 0.460142 0.174487 0.022245 0.017095 0.062928 0.084150 0.028714 0.029033 0.006435 0.187346 0.021906 0.036233 -0.009400 0.022498 0.031743 0.005770 -0.195376 0.033885 0.041612 0.018720 0.011487 -0.291701 -0.182927 0.087291 0.084486 0.091709 0.007590 0.040980 0.020370 0.043454 0.007500 0.011202 0.014653 0.019352 0.010847 -0.134436 0.030479 0.138595 0.027091 0.196350 -0.337898 -0.290275 0.019362 -0.008389 -0.056420 0.029911 0.023617 0.033621 0.023699 0.013558 -0.062764 0.142780 0.015380 -0.045601 -0.186069 0.188655
chargesum: -0.00000
title: Mulliken charges with hydrogens summed into heavy atoms:
elementType: Pd C O C C C C C C O O C C C C C C C C C C Na C C C C C O C O C C C C N C C C O O C C C C C C O
charge: -0.500776 0.192139 -0.251449 0.012341 0.001171 0.122535 -0.036941 -0.060291 0.184533 -0.272297 -0.338164 0.044349 0.066508 -0.288004 0.236817 0.039400 0.010020 -0.031892 -0.049454 -0.045686 -0.051971 0.460142 0.276755 0.148332 0.245485 0.044842 0.005770 -0.195376 0.105704 -0.291701 -0.182927 0.156232 0.146642 0.136561 0.064967 0.057570 0.138595 0.207324 -0.337898 -0.290275 -0.056420 0.053610 -0.039147 0.049001 -0.032043 0.142780 0.002586
chargesum: -0.00001
1716.lowfreq: -276.5017 -5.0909 -2.4573 -0.0012 -0.0010 -0.0009 3.7756 14.5649 15.1041
frequency: -276.5016 14.5524 15.0826 20.5274 24.1348 32.5846 34.2728 39.5015 50.3460 54.1266 54.3501 64.3799 68.8086 72.2180 76.8088 82.5202 85.6414 94.0434 99.9473 109.8493 114.7735 115.1445 126.9209 131.7080 142.1284 152.8115 157.6405 166.5910 167.2182 171.7061 172.4416 184.3911 192.2031 201.6714 207.2551 214.0635 222.6814 223.6059 224.6335 233.7683 241.9254 246.0395 254.8386 263.9845 264.5537 277.0199 285.1871 290.4804 296.7421 317.8961 322.1245 327.3806 338.0198 347.0510 355.1399 358.1941 364.0471 368.0676 374.7484 385.9172 390.8717 392.9619 400.2077 410.8211 415.9431 419.5687 421.1005 431.0679 439.7814 455.4945 457.8677 460.6553 478.9038 486.7870 514.5066 520.6130 546.4247 549.1479 565.1388 577.6413 585.8285 612.8127 622.2844 629.5494 634.8619 638.3791 672.4982 693.7038 707.3914 712.8020 718.5017 728.3553 745.8876 750.8781 755.2832 758.2192 782.0461 791.8929 805.1655 818.1483 819.5406 830.3069 838.3170 846.7263 849.5968 854.3524 862.3630 867.2862 877.8628 892.3668 897.5998 903.3379 907.5753 914.6811 920.5387 924.6791 936.7160 939.1650 958.6881 960.1040 972.4299 980.5895 984.1630 984.5343 989.1277 992.8952 1002.0624 1003.5534 1010.1647 1015.2230 1017.3243 1024.8428 1028.0391 1037.3299 1043.4152 1045.0035 1054.1132 1063.2353 1074.8927 1084.6080 1087.3289 1096.8777 1109.3909 1117.7583 1121.0051 1143.5519 1150.9484 1152.1642 1157.0617 1179.4108 1194.6229 1207.5850 1207.9324 1219.3035 1221.3886 1223.5650 1236.7747 1240.4691 1244.8580 1248.7109 1259.6114 1263.9899 1276.6416 1278.4023 1289.3387 1303.0819 1304.2941 1314.5093 1317.9704 1337.8869 1353.5837 1360.2024 1364.7809 1365.1501 1368.4437 1371.2106 1373.4327 1378.9876 1380.6927 1381.2095 1393.1243 1399.8278 1409.7118 1411.9802 1413.1059 1419.2414 1422.7262 1426.8016 1429.1628 1429.8458 1431.5326 1433.0193 1434.4101 1434.7444 1434.8846 1435.8179 1439.2635 1442.7312 1449.8596 1450.8656 1452.0807 1456.0715 1457.8977 1472.2947 1488.8445 1493.6753 1551.4034 1553.1603 1568.0540 1582.6600 1622.1724 1653.2626 1664.0307 1680.2786 1701.6497 1737.2387 1757.0074 1837.0539 1855.3214 3059.5394 3072.7092 3072.8735 3075.2163 3076.3557 3076.6883 3080.4342 3087.4574 3090.0646 3096.8431 3124.7467 3144.8947 3151.5170 3155.7610 3159.9200 3161.4906 3164.6250 3166.8539 3170.8751 3175.7320 3178.6124 3179.9473 3180.1919 3185.9827 3195.3758 3196.9192 3203.5019 3203.9252 3204.2842 3206.0058 3209.9464 3213.8826 3214.6045 3219.8972 3222.4193 3227.2459 3231.9676 3237.0610 3258.3752 3279.1991 3524.2578 3883.4845
redmass: 10.0710 1.3351 2.4337 5.0715 4.7672 3.6014 4.7965 4.9748 5.0022 6.5201 4.0123 5.4920 6.5451 6.7096 8.9760 4.1911 6.5208 6.3490 7.4157 7.2951 9.5497 5.8496 5.2517 3.4599 7.6445 3.7651 4.5361 2.5301 6.3438 4.3816 3.6850 2.3148 4.3550 1.7102 2.6292 2.2165 4.9912 1.7157 1.7530 4.5108 4.0051 3.9856 3.7173 1.1042 3.4338 2.9209 1.0808 5.4618 5.6743 4.1645 3.0313 2.7289 3.1454 2.4341 2.4409 1.7138 3.1591 3.6659 3.5342 2.8026 3.0246 1.2952 4.1472 3.9728 3.3850 2.8671 3.6878 3.3695 3.2716 2.8614 5.3585 2.9155 4.6792 4.3517 4.3258 3.8654 3.2073 4.1452 2.9750 4.3622 3.9262 2.8297 3.8028 5.8550 6.3263 1.6302 2.6822 3.6281 4.5390 4.3651 4.9270 3.7847 2.9831 2.5494 3.8805 3.1640 3.1578 8.6507 3.5746 4.9551 2.8913 1.8017 1.2553 1.5518 2.9408 1.9190 1.2627 2.1379 2.9930 2.7290 2.0325 3.0377 1.9464 1.5198 1.5127 1.6025 1.2053 2.2923 2.8541 1.3003 1.3330 1.3905 1.4149 1.4302 1.4941 1.4831 1.6302 1.9477 1.3846 2.0827 2.8437 1.4167 1.4598 1.4957 2.3466 1.6552 1.8829 1.9886 1.9994 2.2427 1.2931 3.5101 1.7534 1.8903 1.2868 1.1927 1.8520 1.2412 1.2041 1.0899 1.7466 2.5321 1.3901 2.6090 1.7533 1.9364 1.3388 1.9317 1.7235 2.3639 1.4162 2.1050 2.1260 2.5392 1.7278 1.3160 1.2973 1.6562 2.7056 1.7580 6.8804 1.4379 1.5246 1.5454 1.5212 1.2833 1.8617 1.3951 1.3162 1.3229 6.1443 1.5338 1.2702 1.0584 2.3550 2.1379 2.2622 1.1855 1.4936 1.4248 1.1073 1.1504 1.0604 1.0424 1.0928 1.1113 1.1035 1.1756 1.4175 1.9453 3.0325 1.1580 1.8911 1.1559 4.0540 5.2515 3.7745 3.3183 6.1432 4.7802 6.8212 7.3489 7.0579 7.1072 7.1866 12.2709 11.9322 10.7455 11.5499 1.0376 1.0380 1.0383 1.0640 1.0373 1.0365 1.0385 1.0386 1.0622 1.0613 1.0985 1.0866 1.1037 1.1027 1.1019 1.1069 1.1032 1.1042 1.1040 1.1032 1.1048 1.1041 1.1044 1.1048 1.1033 1.1042 1.0911 1.0881 1.1033 1.0896 1.0895 1.1034 1.0896 1.0963 1.0953 1.0917 1.0957 1.0942 1.0917 1.0911 1.0768 1.0660
irintensity: 452.4133 0.5579 0.0847 0.2206 0.3406 0.1949 0.3631 0.3307 0.1282 0.0360 0.5079 0.0471 1.8638 0.1635 5.3266 1.7678 1.0059 1.6079 11.5972 4.1793 1.4449 0.1264 0.2164 0.1452 6.5302 7.7281 2.6559 1.7433 6.5065 12.8101 6.0252 1.0613 7.9247 3.3980 3.8002 2.0455 6.2891 6.3154 3.3218 13.6816 1.7587 8.6278 2.8032 0.5113 18.7144 1.4988 0.0784 9.7655 53.6394 8.1076 18.3758 13.0205 5.5376 1.7748 1.9423 0.1991 14.6011 12.0951 11.1936 8.2681 2.6988 99.0435 20.9548 1.2687 14.8386 0.2344 6.3263 6.9793 0.3018 4.3525 1.2048 1.3842 3.9685 1.9800 1.3323 7.6420 9.8163 19.5527 12.1368 7.0754 22.0287 45.1598 25.6866 0.3196 0.9107 31.2273 3.9138 33.8812 2.7099 0.6105 13.4900 3.7437 2.9651 6.7214 7.8250 6.6797 6.8321 45.7112 1.3010 1.3854 16.4923 11.8377 0.1136 15.0787 5.2576 2.0929 0.6770 22.8022 18.8484 3.0618 15.6899 17.0103 16.3538 16.3667 0.8713 1.2312 0.3101 16.4367 1.6022 15.2276 7.7899 1.1217 11.1310 1.0907 89.1366 25.8214 22.1317 2.2425 0.3902 4.3666 14.4066 0.2341 2.2655 12.0658 1.7304 3.4350 28.2980 17.0526 20.7453 24.3327 12.9693 48.7009 3.6579 19.0942 8.5298 30.0212 7.7520 28.6347 131.5533 11.2286 5.6403 10.7171 32.8622 307.6768 5.2867 59.8247 7.4302 0.3560 4.9940 11.3862 0.3735 5.8946 51.3418 44.7110 6.0657 1.3046 17.2269 17.5018 53.0872 14.2208 1.5963 2.8312 43.0212 28.1285 28.2151 19.7996 16.8677 0.4898 59.1742 20.4894 36.4407 8.4353 46.5463 2.8325 37.6376 316.1075 15.0370 3.9599 11.1181 1.9008 5.1027 29.2908 13.3831 6.2386 6.9540 10.2634 14.8319 81.0696 52.9113 59.7365 420.4988 100.0089 8.7069 60.6998 40.8357 173.1909 90.2630 28.2875 188.2218 14.2535 325.4775 8.0301 55.6601 48.3616 0.1518 225.4643 626.7599 317.7528 136.4114 15.3613 14.8662 37.4563 14.1910 14.6232 12.2698 18.5130 18.0400 4.2338 18.6712 6.4950 7.9691 6.2048 11.3958 3.2264 4.6237 24.3829 7.6241 20.0311 8.0882 24.1110 11.4358 17.6576 25.5619 6.1457 15.1699 3.4698 14.8617 2.3382 10.3872 16.5728 2.9194 5.0263 13.4065 5.3811 1.4649 2.9991 0.4707 1.1958 10.6325 263.5210 117.1937
temp: 333.150 k
press: 1.00000 atm
elementType: 46 6 8 6 6 6 6 6 1 1 6 8 8 6 1 1 6 6 1 6 1 1 1 6 6 6 6 1 6 1 6 1 1 11 6 1 1 1 6 1 1 1 6 1 1 6 1 1 6 8 6 1 1 1 8 6 6 6 6 1 1 1 1 1 1 1 1 1 7 6 6 1 6 8 8 1 1 6 6 6 6 1 6 1 6 1 1 8 1
symmnumber: 1
zpe: 1889850.8 jmol-1
zpe.correction: 0.719806 hartree
zpe.thermalcorrener: 0.779057 hartree
zpe.thermalcorrenthalpy: 0.780112 hartree
zpe.thermalcorrgfe: 0.619814 hartree
zpe.sumelectzpe: -2338.859117 hartree
zpe.sumelectthermal: -2338.799865 hartree
zpe.sumelectthermalent: -2338.798810 hartree
zpe.sumelectthermalfe: -2338.959109 hartree
dipole: 1.8549 -1.3141 4.8422
dipole: 5.3493
quadrupole: -265.2565 -274.3373 -295.5838
quadrupole: -10.3773 -6.4090 0.3830
quadrupole: 13.1360 4.0553 -17.1913 -10.3773 -6.4090 0.3830
hfenergy: -2339.5789229 hartree
pointgroup: C01 [X(C36H42N1Na1O8Pd1)]
dipole: 0.729791 -0.5170083 1.9050637 debye
polarizability: 614.614659|-46.9612437|424.4209853|-11.2228776|-19.0977058|372.9701917 unknown
InChI: InChI=1/C22H24O3.C14H18NO5.Na.Pd/c1-5-19(23)12-9-17-14-16(3)8-13-20(17)22(4,21(24)25)18-10-6-15(2)7-11-18;1-14(2,3)20-13(19)15-11(12(17)18)8-9-4-6-10(16)7-5-9;;/h6-11,13-14H,5,12H2,1-4H3;4-7,11,15-16H,8H2,1-3H3;;/q-3;-1;+4;/rC36H42NNaO8Pd/c1-8-24-15-16-25-26-19-29-35(7)30(25)47(29,35)28-18-23(39)14-11-21(28)17-27(37-32(40)41-33(3,4)5)31-43-38(42-24,46(31)47)36(44-38,45-38)34(26,6)22-12-9-20(2)10-13-22/h9-14,16,18-19,27-30,37,39H,8,15,17H2,1-7H3
charge 0 multiplicity 1
89 atoms
Pd 0.33831109 -1.1493284 -0.09766074
C  4.01261343 0.78504042 0.91623791
O  3.99856065 0.35628251 2.05667121
C  -0.86137452 -2.523821 1.16436016
C  -2.08012584 -2.31889652 0.4308357
C  -2.08014923 0.02848115 1.06459778
C  -0.79367523 -0.18672042 1.66861525
C  -0.27539792 -1.479819 1.92675607
H  -0.46286814 -3.53733818 1.26227354
H  -0.30139224 0.65543091 2.16436412
C  -3.08521022 0.27310444 -1.57846605
O  -2.63734319 -0.08520219 -2.67686684
O  -2.94365471 1.45618003 -1.11971039
C  -2.65727232 1.29849422 0.95642744
H  -3.74195511 1.35350522 0.90620002
H  2.08366715 0.41186631 0.51791936
C  -2.69389737 -1.08687666 0.36982086
C  -3.78022832 -0.78185157 -0.65599514
H  -2.46563871 -3.15760741 -0.14912412
C  -4.16481312 -1.9985384 -1.49942722
H  -3.29790083 -2.38553637 -2.05052183
H  -4.59551716 -2.78713426 -0.86331328
H  -4.92227252 -1.69802564 -2.23666716
C  -5.06085927 -0.24289759 -0.02471347
C  -5.8668586 0.68938562 -0.6934357
C  -5.51195961 -0.74954823 1.19832419
C  -7.0755181 1.10896923 -0.14293426
H  -5.53492165 1.10135207 -1.64984834
C  -6.72426164 -0.32548878 1.74716189
H  -4.90057802 -1.48622718 1.72876176
C  -7.52712543 0.61257095 1.08931944
H  -7.68521383 1.84091501 -0.68088832
H  -7.05470691 -0.73354346 2.70676197
Na -1.10439551 1.81478549 -2.4580954
C  0.88131991 -1.72022418 2.8592434
H  0.53385394 -1.83340231 3.89868714
H  1.41064927 -2.64162504 2.57308226
H  1.60835545 -0.89315203 2.82464657
C  -8.83282289 1.07998736 1.67503056
H  -8.81679175 2.16288172 1.87381878
H  -9.66950062 0.89220245 0.98472914
H  -9.05381797 0.56713612 2.62138267
C  -1.97945691 2.59027037 1.33434403
H  -1.6221285 2.50423664 2.37360466
H  -2.73006224 3.39363649 1.31294502
C  0.52774238 3.23875302 1.10657739
H  0.39217475 3.6625544 2.1168847
H  0.88580503 2.20569084 1.26061211
C  -0.82701542 3.10646105 0.45675473
O  -1.01399032 3.45880373 -0.68899107
C  1.52119359 4.02676955 0.27265831
H  1.55605725 3.640971 -0.75573945
H  1.22935712 5.0850692 0.2060947
H  2.53009471 3.96631485 0.70404997
O  5.10496916 1.22349505 0.26683545
C  6.40945836 1.24221667 0.89373175
C  6.85243058 -0.18247054 1.21056163
C  6.3882684 2.12447385 2.13768155
C  7.30435953 1.85298935 -0.17617464
H  7.86225186 -0.16818949 1.64678714
H  6.16203524 -0.6518818 1.92311372
H  6.8902995 -0.78074435 0.28626891
H  5.76595092 1.68037398 2.92359223
H  7.41405399 2.24941959 2.51531191
H  5.99168892 3.11932889 1.88384024
H  7.2727702 1.24422328 -1.09197881
H  6.96691767 2.87015519 -0.42204355
H  8.34341805 1.90080444 0.18033595
N  2.90217203 0.89484661 0.13642598
C  2.88461989 1.08397027 -1.29859313
C  1.43965576 1.27422488 -1.7704677
H  3.42948806 2.00146965 -1.56347949
C  3.52002429 -0.10313022 -2.07061588
O  0.50433537 0.82623416 -1.01885839
O  1.23960476 1.83332035 -2.8567379
H  3.28099136 0.02704349 -3.13762322
H  4.61205585 -0.04184343 -1.95281608
C  3.02291217 -1.41664338 -1.53612477
C  1.73574054 -1.90168577 -1.88398359
C  3.75417992 -2.12425415 -0.58669788
C  1.21112778 -3.0539261 -1.2726232
H  1.18368709 -1.42983335 -2.70360354
C  3.25069143 -3.2853653 0.02105333
H  4.74337787 -1.75801781 -0.29670601
C  1.98273169 -3.74599889 -0.30871443
H  0.27011182 -3.49447036 -1.60953269
H  3.84757884 -3.82048038 0.76573367
O  1.42496347 -4.84470578 0.25951721
H  2.0542508 -5.25777016 0.8675342
