program: Gaussian 16
title: freeze mn15/BS1
version: ES64L-G16RevC.01
method: RMN15
basis: GenECP
operation: Freq
keyword: #N
keyword: Geom=AllCheck
keyword: Guess=TCheck
keyword: SCRF=Check
keyword: GenChk
keyword: RMN15/GenECP
keyword: Freq
converged: YES YES NO NO
title: Mulliken charges:
elementType: Pd C O C C C C C H H C O O C H H C C H C H H H C C C C H C H C H H Na C H H H C H H H C H H C H H C O C H H H C O O C H H H C H C N H H C H C C C O O C H C H C C H H C C C O H H H H H H H H H H O
charge: -0.010194 0.183810 -0.275697 -0.012114 -0.033161 0.044244 -0.077126 -0.030539 -0.044661 -0.024021 0.219166 -0.339894 -0.284623 -0.136638 0.039718 0.199725 0.094574 -0.231273 -0.044416 0.180018 0.019061 0.015677 0.010263 0.014036 0.016395 0.011725 -0.025570 -0.007104 -0.015666 -0.016120 -0.042682 -0.042047 -0.038045 0.379779 0.093119 0.003212 0.037239 0.026849 0.085230 0.023654 0.032416 0.009830 0.205424 0.037946 -0.003958 0.073012 0.017760 0.016635 -0.034740 -0.180397 -0.025927 0.091957 0.045146 0.022070 0.220253 -0.408129 -0.241109 0.087229 0.040814 0.059549 0.037047 0.063158 0.019263 0.174213 -0.145629 0.021767 0.004318 -0.093374 0.151038 0.215796 0.023634 -0.022632 -0.275892 -0.290027 0.044672 0.019900 -0.030010 0.004582 -0.178133 0.102548 0.002575 -0.023071 0.084784 0.089958 0.084903 -0.173670 0.006202 0.010000 0.039726 0.008459 0.016885 0.016028 0.005842 0.040527 0.011776 0.189323 -0.288167
chargesum: -0.00000
title: Mulliken charges with hydrogens summed into heavy atoms:
elementType: Pd C O C C C C C C O O C C C C C C C C C C Na C C C C C O C C O O C C C N C C C C O O C C C C C C C O O
charge: -0.010194 0.183810 -0.275697 -0.056776 -0.077577 0.044244 -0.101146 -0.030539 0.219166 -0.339894 -0.284623 0.102805 0.094574 -0.231273 0.225018 0.014036 0.009292 -0.004395 -0.067617 -0.053711 -0.042682 0.379779 0.160419 0.151129 0.239411 0.107407 -0.034740 -0.180397 0.133246 0.220253 -0.408129 -0.241109 0.224638 0.082421 0.200298 0.005409 -0.093374 0.215796 0.043534 -0.018050 -0.275892 -0.290027 0.047247 -0.053081 -0.178133 0.102548 0.140712 0.131330 0.143048 0.015653 -0.288167
chargesum: 0.00000
1716.lowfreq: -1186.1342 -4.2568 -0.0011 -0.0008 0.0007 2.8372 4.9711 7.1262 10.9364
redmass: 1.1254 1.0273 5.1775 5.0862 5.1412 4.6326 4.9476 4.2410 1.2812 3.4837 3.1498 4.5827 4.0459 5.8912 4.0115 5.6684 5.0621 4.4888 3.9155 5.3864 3.8083 6.1436 3.3361 3.4203 4.0802 1.5354 3.9670 7.5602 3.8795 4.8248 5.2614 7.8590 8.9817 5.5299 4.9092 6.9367 5.6975 6.2328 5.0325 2.3109 2.1551 4.3110 4.6887 4.3343 3.8207 6.8299 2.6746 1.0969 2.9856 2.2765 1.2852 2.9793 3.2145 3.6437 4.4730 4.1858 2.6311 2.8092 3.3715 4.4293 3.6159 2.4476 4.2689 1.8585 1.3717 4.1826 1.4456 3.5894 3.8025 4.8358 4.0086 3.0882 2.9419 2.7367 4.5124 3.0336 3.3705 2.8837 5.4571 3.6897 3.8345 4.1857 3.3557 3.7562 1.2421 2.3167 3.1091 3.7011 4.8685 3.3396 3.1883 2.9853 4.4184 5.7630 6.2068 3.5458 5.7764 5.4382 3.8665 6.2654 4.1912 2.9170 4.1238 4.5697 4.0415 3.8316 5.0531 2.8190 6.9290 1.4007 3.7500 5.0452 1.5921 1.4126 1.5415 2.1364 2.3601 1.2645 2.5246 3.4441 2.9775 1.3567 2.4606 1.5096 1.6147 1.7472 1.7510 1.2049 2.4065 1.6383 1.3778 1.6756 1.3904 2.7913 1.6594 1.4449 1.6346 2.3331 1.5771 1.5210 1.9209 2.8444 1.4172 1.3659 1.4587 1.8881 1.9996 1.6324 1.6261 2.5614 2.3822 2.3608 2.1638 1.3282 4.2312 3.1091 1.8428 1.5164 1.5907 1.3213 1.2162 1.3015 1.1038 1.6077 1.2374 1.4195 1.5351 2.0862 1.8599 2.4458 2.2609 1.4387 2.0540 2.4986 1.5462 2.1236 2.1098 2.1871 1.5367 1.2480 1.7852 1.3253 1.4875 1.4331 1.8773 1.3267 4.1910 1.9719 2.4488 3.9227 1.8815 1.5499 1.6605 1.3016 5.8160 1.5313 1.3915 1.6843 1.3072 1.0649 1.0433 1.3245 1.7731 1.1557 1.0878 1.4899 1.4077 1.0447 1.0512 1.0744 1.0586 2.0278 1.1493 1.8175 1.1866 1.1172 1.1384 1.0757 1.8135 1.1491 2.0444 3.3406 1.0770 2.7135 3.7925 4.1431 3.1956 1.4705 3.7735 7.2013 7.1800 6.9456 7.7962 7.7418 7.2113 9.8338 7.4129 12.2294 11.3696 11.3698 1.0718 1.0411 1.0808 1.0385 1.0366 1.0381 1.0649 1.0362 1.0377 1.0384 1.0621 1.0378 1.0855 1.0982 1.1023 1.1027 1.1071 1.0940 1.1042 1.0987 1.1041 1.1042 1.1044 1.1042 1.1057 1.1050 1.1047 1.1041 1.0918 1.0999 1.0893 1.0914 1.1034 1.0902 1.1029 1.0913 1.0944 1.0935 1.0940 1.1090 1.0952 1.0918 1.0928 1.0785 1.0662
irintensity: 1355.9072 0.3988 0.0396 0.1620 0.0831 0.0230 0.7889 0.5476 0.8537 1.0912 0.1031 2.2859 0.5676 0.4121 0.6879 2.0928 1.2501 1.9519 2.0203 3.2533 2.5272 2.9171 1.9268 0.7888 1.6477 0.1768 1.9708 5.1392 0.7687 0.7670 0.2181 6.4215 4.7430 1.5933 0.1285 3.3292 0.0201 10.5218 1.4140 7.6202 1.2736 12.6219 7.1855 5.4272 1.5701 2.3320 9.0473 0.1358 11.7987 0.4219 0.9514 5.9850 5.9460 0.9227 5.2444 13.9419 0.1118 4.6517 3.5823 14.9109 16.4225 0.3237 5.6625 15.4987 91.2649 2.1091 7.3023 1.7699 7.9475 6.8680 9.6076 7.2209 0.4774 3.9374 43.8142 0.9775 14.4270 1.8441 8.0571 6.3617 7.6289 12.7592 3.2377 12.1830 62.5446 48.8086 21.1154 19.0119 6.1425 1.8689 13.5514 9.0766 17.6212 1.0923 3.7795 16.1840 4.7517 61.6477 4.2244 42.5904 16.1661 6.2879 18.3806 0.1538 4.5209 3.3734 13.4748 12.8446 12.5344 3.8775 8.6378 15.3788 2.9247 11.9965 10.9175 8.2584 8.4250 1.7401 8.9155 6.1941 57.6889 6.1438 4.8493 0.7930 1.8972 13.4078 3.2177 0.3065 7.8293 8.8213 0.4212 7.2677 1.4763 2.8738 2.0181 1.6967 3.7975 5.0594 1.2915 3.5743 0.3815 12.6348 0.1153 3.2925 3.1468 10.7517 4.8590 4.3348 3.8454 5.2395 3.2246 2.7139 11.1527 17.0196 73.7729 14.3204 2.1278 6.5358 1.3506 13.2222 117.2472 5.2002 25.7702 67.4953 16.2427 7.9752 7.8407 99.9258 137.5885 8.3094 240.0620 12.9549 1.2740 8.8062 17.8721 6.6984 44.5065 1.9611 26.4927 8.6605 135.7083 3.2971 11.7446 6.8207 4.8839 2.1682 14.7187 14.6043 0.4253 6.1324 23.0556 29.8153 22.1992 14.8097 21.8229 19.6624 0.3194 15.2651 65.1943 29.1210 0.3422 66.1025 300.1451 48.9017 11.9779 33.1668 0.5705 4.1861 7.4873 1.2636 12.7144 786.4977 46.6575 64.9220 14.2245 12.7387 17.5700 0.6587 19.2324 40.0545 21.0531 17.2453 5.9695 285.5430 41.0735 1142.2652 29.8165 111.8858 19.7504 1.7100 11.4477 10.1731 18.1833 80.4680 9.0776 340.3418 150.6709 315.8254 238.5808 165.4893 9.1765 15.3955 4.5415 35.5956 11.0523 28.2160 12.8172 7.6183 20.8634 20.2927 5.9092 1.1594 20.0006 14.4598 10.5893 8.9358 2.8146 6.2926 5.1496 21.2988 25.8952 20.8572 13.6886 10.5370 6.2630 18.9859 30.5514 7.5905 2.2734 3.9293 8.1997 17.5332 2.6200 13.4505 4.6804 15.8494 2.3401 0.4474 2.3800 2.2623 1.3614 7.3175 4.1332 91.8161 112.8652
temp: 333.150 k
press: 1.00000 atm
elementType: 46 6 8 6 6 6 6 6 1 1 6 8 8 6 1 1 6 6 1 6 1 1 1 6 6 6 6 1 6 1 6 1 1 11 6 1 1 1 6 1 1 1 6 1 1 6 1 1 6 8 6 1 1 1 6 8 8 6 1 1 1 6 1 6 7 1 1 6 1 6 6 6 8 8 6 1 6 1 6 6 1 1 6 6 6 8 1 1 1 1 1 1 1 1 1 1 8
symmnumber: 1
zpe: 2050023.3 jmol-1
zpe.correction: 0.780813 hartree
zpe.thermalcorrener: 0.846833 hartree
zpe.thermalcorrenthalpy: 0.847888 hartree
zpe.thermalcorrgfe: 0.668556 hartree
zpe.sumelectzpe: -2567.448283 hartree
zpe.sumelectthermal: -2567.382263 hartree
zpe.sumelectthermalent: -2567.381208 hartree
zpe.sumelectthermalfe: -2567.560541 hartree
dipole: 0.7873 5.1025 -1.3394
dipole: 5.3338
quadrupole: -299.5580 -296.2599 -306.1131
quadrupole: 4.4270 -1.5966 -1.8368
quadrupole: 1.0856 4.3838 -5.4694 4.4270 -1.5966 -1.8368
hfenergy: -2568.229096 hartree
pointgroup: C01 [X(C38H46N1Na1O10Pd1)]
dipole: 0.3097288 2.0074959 -0.5269757 debye
polarizability: 553.323308|16.5016854|457.9378255|19.5574129|-31.3319098|435.9875727 unknown
InChI: InChI=1/C22H25O3.C14H18NO5.C2H3O2.Na.Pd/c1-5-19(23)12-9-17-14-16(3)8-13-20(17)22(4,21(24)25)18-10-6-15(2)7-11-18;1-14(2,3)20-13(19)15-11(12(17)18)8-9-4-6-10(16)7-5-9;1-2(3)4;;/h6-8,10-11,13-14H,5,9,12H2,1-4H3;4-7,11,15-16H,8H2,1-3H3;1H3;;/q-1;;-1;2*+1/rC38H46NNaO10Pd/c1-9-28(42)22-38-31-20-24(3)12-19-30(31)37(8,27-15-10-23(2)11-16-27)34-47-40-49(51(38,52-38,50(34)40)48-25(4)41)33(44)32(39-35(45)46-36(5,6)7)21-26-13-17-29(43)18-14-26/h10-20,32,38-39,43H,9,21-22H2,1-8H3
charge 0 multiplicity 1
97 atoms
Pd 0.21222117 -1.03933463 -0.04810305
C  -0.49132707 -3.67282972 -0.45159268
O  0.38799703 -3.82766698 0.42371875
C  3.93703911 -1.25880224 3.92027462
C  3.9187121 -0.17957756 3.03457372
C  2.90680479 -1.53364095 1.3134143
C  2.94004172 -2.60190306 2.22378174
C  3.4411016 -2.49945512 3.52570051
H  4.34323011 -1.12685289 4.92688563
H  2.53266379 -3.56443342 1.89578951
C  2.074649 1.23724405 0.26332529
O  1.09283467 0.58714055 0.79286528
O  1.88226398 2.14741775 -0.55950317
C  2.25324392 -1.89997391 -0.00492985
H  2.48591752 -2.97174667 -0.15236557
H  1.11559875 -2.60164289 0.26979314
C  3.41284415 -0.27371868 1.73425786
C  3.48118253 0.94841956 0.81554854
H  4.32322204 0.77011918 3.38451376
C  3.82466947 2.25931457 1.56327162
H  4.84085596 2.2147964 1.97867588
H  3.78174758 3.08616571 0.84186704
H  3.10565571 2.46879804 2.37067834
C  4.57035982 0.77301551 -0.25735692
C  4.60196097 1.55087604 -1.42655439
C  5.61027088 -0.14468931 -0.06184774
C  5.60111909 1.37027825 -2.38054337
H  3.81634315 2.28712508 -1.59670856
C  6.61642869 -0.31197889 -1.01734774
H  5.63135169 -0.75817422 0.8412187
C  6.62758789 0.43150919 -2.20091326
H  5.58638934 1.9788177 -3.28997438
H  7.40767301 -1.04539 -0.83715722
Na -0.39810164 2.05943997 -0.33134618
C  3.42877102 -3.68733197 4.44870306
H  3.91494516 -3.45522014 5.40642503
H  2.39829608 -4.01131769 4.66079927
H  3.94974317 -4.54679098 4.00032496
C  7.70756993 0.25624955 -3.23430273
H  7.28188497 0.11335955 -4.23894015
H  8.35781719 1.14396158 -3.28322843
H  8.34300974 -0.61083984 -3.00687379
C  2.6525276 -1.31817579 -1.36242779
H  3.73675796 -1.4617725 -1.53560794
H  2.48139091 -0.24114027 -1.48739652
C  1.55669682 -1.23420746 -3.68662046
H  2.441174 -0.65850456 -4.01030325
H  1.26946167 -1.92566736 -4.4908845
C  1.94459012 -2.0627879 -2.48429339
O  1.70797544 -3.25079567 -2.40231165
C  0.40871295 -0.27463592 -3.35377372
H  -0.46710345 -0.82144578 -2.97397164
H  0.71248285 0.45532659 -2.58292437
H  0.1097509 0.29247238 -4.24680398
C  -2.53052239 -0.26780749 0.33852346
O  -1.45853009 0.10777967 -0.29654696
O  -2.631433 -1.23361526 1.07497376
C  -1.21523168 -4.84734101 -1.03710527
H  -2.22700306 -4.56234169 -1.34659753
H  -0.64804449 -5.15657776 -1.9282051
H  -1.23493432 -5.6783769 -0.32369246
C  -3.72137339 0.67604685 0.15895204
H  -3.61320246 1.24760085 -0.776612
C  -3.78777949 1.66341963 1.34832567
N  -4.91756589 -0.12370657 0.09101268
H  -4.65937767 2.31105411 1.16983026
H  -3.98105923 1.06011221 2.24923891
C  -2.54050786 2.48305323 1.54057757
H  -4.89007914 -1.04572993 0.52242976
C  -6.08161547 0.40699036 -0.36636737
C  -1.49622372 2.0135507 2.35770291
C  -2.34949466 3.7040626 0.87734241
O  -6.17811283 1.54361151 -0.79706106
O  -7.07883127 -0.48501692 -0.28064965
C  -0.31162907 2.72742772 2.51292949
H  -1.6074921 1.04780397 2.85967614
C  -1.15656935 4.42917362 1.01642388
H  -3.14759611 4.10177667 0.24340111
C  -8.41950571 -0.16480436 -0.72184202
C  -0.1283371 3.94371438 1.83929864
H  0.50108031 2.33873455 3.12900266
H  -1.03017932 5.38460309 0.49772403
C  -8.98315956 0.9911753 0.09839091
C  -9.19539084 -1.44465969 -0.44085659
C  -8.42196124 0.14353783 -2.21563333
O  1.04892228 4.58506527 2.00288128
H  -10.04200274 1.14215644 -0.15964405
H  -8.92010474 0.75706081 1.17192559
H  -8.43011574 1.91700564 -0.10149324
H  -10.24648036 -1.32410163 -0.74039616
H  -8.76073542 -2.28435084 -1.00209303
H  -9.15774247 -1.68549961 0.63138059
H  -9.45839886 0.26769156 -2.56338939
H  -7.86129972 1.06289325 -2.42430966
H  -7.96841801 -0.69007087 -2.77280988
H  1.08366628 5.38594491 1.46197434
O  -0.77160788 -2.52127537 -0.9307784
