program: Gaussian 16
title: mn15/BS1
version: ES64L-G16RevC.01
method: RMN15
basis: GenECP
operation: Freq
keyword: #P
keyword: freq=noraman
keyword: MN15/genecp
keyword: temperature=333.15
keyword: nosymm
title: #P freq=noraman MN15/genecp temperature=333.15 nosymm
basis: NPDir=0 NMtPBC= 1 NCelOv= 1 NCel= 1 NClECP= 1 NCelD= 1
basis: NCelK= 1 NCelE2= 1 NClLst= 1 CellRange= 0.0.
basis: One-electron integrals computed using PRISM.
converged: YES YES NO NO
title: Mulliken charges:
elementType: C C C C C C H H H H C C H H H C C C C H C H C H H C H H H C O O C H H H Pd Na O C O C H N C H C H O C O O H H H H C H H C C H C C C C C C H C C H C C H H C H H H H O C O C H H H
charge: -0.026870 0.039592 0.051483 0.008931 -0.016735 -0.041942 -0.045902 -0.044105 -0.039640 -0.041518 -0.252842 0.084459 0.032149 0.021005 0.008325 0.057288 -0.070508 0.016312 -0.003889 0.252675 -0.005497 -0.023288 -0.023109 -0.022774 -0.037516 0.136314 0.063459 0.035584 0.020900 0.275177 -0.352609 -0.269446 0.089972 0.038680 0.021099 0.009103 0.059021 0.314018 -0.230200 0.187478 -0.383442 0.060204 0.026462 -0.098698 0.044996 0.145175 0.234782 0.011657 -0.290399 0.112291 -0.257954 -0.281817 0.247986 0.004622 0.020233 -0.002283 0.273325 0.022983 0.037106 0.031433 -0.074745 0.041819 -0.014111 0.001332 0.083745 -0.005305 0.059703 0.019658 -0.036288 -0.025989 0.015063 -0.029996 -0.033975 0.027631 -0.014453 -0.034236 0.036545 -0.005673 -0.018036 -0.013771 0.008913 -0.294759 0.134561 -0.274611 0.078862 0.052552 0.041062 0.041205
chargesum: -0.00000
title: Mulliken charges with hydrogens summed into heavy atoms:
elementType: C C C C C C C C C C C C C C C C O O C Pd Na O C O C N C C O C O O C C C C C C C C C C C C C C O C O C
charge: -0.072771 -0.004513 0.051483 -0.030709 -0.058253 -0.041942 -0.252842 0.145937 0.057288 0.182168 -0.006976 -0.026663 -0.043013 -0.023109 0.256257 0.275177 -0.352609 -0.269446 0.158854 0.059021 0.314018 -0.230200 0.187478 -0.383442 0.086666 0.046477 0.056653 0.234782 -0.042414 0.134863 -0.257954 -0.281817 0.333414 0.073252 -0.074745 -0.014111 -0.034956 0.083745 -0.035301 0.059703 0.005206 -0.060225 0.009390 -0.052011 0.013860 0.045459 -0.294759 0.134561 -0.274611 0.213680
polarizability: 4.91996767e+02 -6.54595195e+01 4.58414810e+02 2.74353146e+01 -4.75683080e+01 4.79903522e+02
1716.lowfreq: -1142.8504 -1.3948 -0.0006 0.0005 0.0007 2.9502 5.5696 11.8033 18.2261
frequency: -1142.8504 11.4076 17.9678 18.5599 30.5476 31.5899 36.5781 38.1762 41.9086 43.7765 46.5670 53.1948 57.8361 63.2586 67.1265 75.0088 84.8525 85.9032 93.4613 99.1188 105.8111 111.0120 115.8692 119.5392 131.1592 135.8985 146.8778 149.8361 153.7958 170.0386 177.0187 181.5427 187.3311 199.1172 207.0321 220.5732 224.6457 226.0053 233.2697 246.4022 257.6285 262.5792 270.1360 274.2411 283.5145 292.9900 300.6019 304.0265 311.5616 316.2827 326.2853 331.8930 334.6792 349.3912 359.5035 367.4184 373.0055 377.0252 398.3003 401.7164 415.7932 425.1371 428.8698 446.8902 455.3176 458.9541 464.3666 469.8314 475.8849 494.6932 503.4133 511.5954 542.1709 555.6723 556.1879 564.4336 573.9640 577.7550 579.3628 595.3401 608.8527 614.0126 615.9522 624.1726 639.2035 659.4706 677.0098 699.2058 712.6934 721.2562 724.5052 740.7112 744.3252 758.4910 760.0625 765.9809 772.6499 784.5686 785.8053 795.2707 800.1103 806.9689 815.7014 823.6831 845.8725 854.7917 856.6742 861.6191 865.1983 867.1776 893.0751 906.3278 912.8155 916.7511 928.4870 937.3232 964.6572 977.7789 981.4494 982.9956 987.2593 987.5665 988.8394 991.7344 1006.0133 1008.0601 1008.6982 1011.5965 1016.7424 1020.1339 1028.4417 1030.5541 1034.7132 1035.3246 1042.4664 1043.7547 1047.1382 1047.4827 1051.2693 1055.4634 1075.6589 1091.3104 1097.8344 1106.9758 1119.8074 1123.4139 1130.5690 1141.2502 1147.1318 1149.5027 1153.0708 1160.4887 1172.9501 1182.4368 1186.1853 1195.6853 1218.3997 1220.5814 1228.3242 1232.7972 1244.6238 1246.6531 1248.0085 1269.2805 1275.6571 1286.2641 1292.0838 1296.5466 1305.8199 1306.4998 1323.2897 1329.3127 1335.6299 1339.2753 1341.7646 1346.4489 1357.0768 1362.0996 1374.0806 1375.8598 1378.7991 1379.5901 1381.2953 1394.8420 1399.7690 1401.1346 1409.4524 1420.6628 1423.9728 1426.4983 1427.5213 1431.2431 1435.3641 1435.8891 1436.7372 1438.7521 1443.6771 1449.4162 1449.5570 1457.2868 1459.0156 1480.4007 1486.6203 1518.8366 1522.2651 1535.8308 1540.9214 1559.9983 1583.3659 1635.9594 1657.2520 1660.6994 1669.0671 1682.1068 1690.0910 1697.7612 1707.0623 1725.8318 1749.7779 1827.8384 1853.0942 3055.5897 3069.3866 3071.5343 3074.0604 3075.5892 3083.4947 3101.0609 3106.4233 3131.0051 3153.9955 3158.7695 3172.1530 3179.9994 3181.9373 3184.3901 3184.9517 3188.7863 3189.9186 3198.1717 3198.5981 3204.4433 3211.6586 3212.6700 3218.6898 3221.4146 3225.1432 3226.9155 3229.6673 3236.6588 3237.3683 3238.1273 3247.9058 3248.1302 3250.9676 3254.4959 3657.9851 3679.6221
redmass: 1.1516 6.4830 5.5157 5.5589 1.7517 1.6195 4.5622 1.4653 3.1954 1.6936 2.0587 4.3352 7.1070 4.8265 3.2655 7.1226 4.6751 5.0328 4.5463 4.6718 4.9390 6.7421 4.1903 8.2911 6.9534 4.9266 7.9731 5.9228 5.3955 5.9763 4.9363 5.4912 6.8376 4.6437 4.8312 5.1219 4.4485 4.7657 4.0782 5.1759 4.1746 3.5870 5.9595 3.5860 2.0207 2.1364 4.9110 2.6967 2.9612 2.2889 6.3516 3.6095 3.8810 3.5724 3.8417 4.0173 4.9988 5.4731 4.1052 4.4389 5.5667 2.9335 3.4914 3.2581 5.0140 2.9779 4.2198 4.8309 4.0236 1.5020 3.9960 5.1770 3.4049 4.3560 3.3655 4.3865 4.9999 4.4161 3.3119 4.8157 3.9818 4.4547 6.8122 2.6634 6.7659 3.2899 6.0311 1.9149 2.3539 6.1278 4.5950 3.4822 4.3121 4.1843 1.6013 1.5667 4.7611 4.3604 7.6094 2.3924 2.3846 3.2437 2.1343 4.2451 2.2333 3.1835 2.2118 1.3572 3.0834 1.7898 2.6872 1.4137 1.6992 2.0973 1.3521 2.9276 2.3791 4.2463 1.4025 2.3021 1.4563 1.4876 1.4004 1.4951 3.6185 1.4734 1.4421 1.3923 2.7978 2.7215 1.3616 2.0186 1.3515 3.0386 1.9119 1.6256 1.6655 2.0485 1.8782 2.1492 2.3817 2.3238 2.1160 1.9222 1.6787 1.3603 2.2270 1.7014 1.1942 1.3142 1.1037 1.2370 2.3521 1.1965 1.0924 1.7691 1.7758 2.0249 1.9842 1.7164 2.2117 1.7230 3.1248 1.6241 1.4428 3.5528 1.5584 2.0108 1.9832 1.3649 2.3703 1.5886 1.8872 2.2749 1.3190 1.3064 1.3838 6.8622 1.7800 4.5418 1.3899 1.4576 1.3710 1.7830 2.4286 3.3041 1.1063 1.1638 2.2695 1.1101 1.4819 1.4092 1.0552 1.0684 1.5276 1.1537 1.1142 1.2156 1.2094 1.6552 1.7743 2.6612 3.0257 3.3217 3.8622 4.4768 5.2674 3.3282 3.7259 6.8619 7.1793 7.0685 7.6437 7.0159 7.8722 7.7225 7.2880 7.0689 11.9766 12.3737 11.5371 1.0832 1.0861 1.0386 1.0386 1.0360 1.0370 1.0372 1.0655 1.0860 1.1021 1.1018 1.1034 1.1042 1.1048 1.1036 1.1060 1.1047 1.1042 1.0912 1.1010 1.0894 1.0910 1.0907 1.0895 1.0872 1.0909 1.0909 1.0953 1.0952 1.1085 1.0940 1.0997 1.0931 1.0927 1.0983 1.0651 1.0788
irintensity: 2692.9507 0.2364 0.0271 0.1218 0.5331 0.2071 0.9551 0.8789 0.9202 1.4064 0.3237 0.4613 7.0297 1.3385 0.4231 2.2517 0.8920 1.1439 0.0972 2.0040 0.6428 0.4918 2.8878 4.7285 3.4793 1.5835 5.8641 2.0775 4.3675 0.3345 0.8776 2.7554 5.3216 0.5512 0.9384 0.6158 2.0520 1.7151 4.7670 16.3489 0.4164 1.8203 7.7586 4.5882 3.1361 4.6068 1.8099 2.3750 1.7726 0.3777 22.8009 5.1262 9.6051 4.3709 8.8659 20.4541 8.8598 23.6827 9.7735 20.8385 1.4673 0.9145 7.4009 6.7356 6.2209 1.8442 6.4546 23.5685 0.7175 77.2194 2.8490 2.8100 4.5787 5.5480 14.6443 7.1662 5.3217 3.0390 0.1626 12.3896 34.5959 10.8386 6.3776 1.7646 0.0663 11.9809 21.9909 62.2191 113.3334 69.3317 3.3118 0.6073 12.9403 10.1135 7.8852 85.8461 10.4758 3.5732 42.1422 34.2974 8.0434 0.6439 0.3263 57.0496 10.3792 6.9686 8.4530 0.3866 1.4040 1.3252 7.6800 1.0611 3.2573 16.3288 5.3564 36.6513 4.9242 12.8310 1.9026 0.6445 2.6824 1.0164 3.0929 0.8830 3.1083 0.3221 2.6363 0.1432 13.1537 8.4758 0.3303 11.0304 0.0347 12.7134 5.8377 6.2004 6.7843 3.6593 0.6087 10.5803 18.5610 13.4610 13.4856 37.7118 4.6668 0.1665 15.7436 20.0235 0.3311 18.3720 0.9820 1.6912 31.5719 296.4474 16.3202 14.8002 7.7090 12.6899 7.1395 16.5821 0.7140 2.1516 0.3367 19.1572 55.9210 11.1686 5.0648 127.7082 80.1790 18.8145 2.5933 83.4243 115.2218 60.6350 0.9240 33.6987 18.0436 2.7696 16.3271 18.0031 0.5143 2.5841 15.3692 81.6832 151.7341 6.7204 35.5796 67.5960 136.2075 11.3023 5.1191 12.0656 11.7436 4.8251 76.9957 60.1438 2.4679 46.2501 7.4352 6.5851 24.8348 25.0576 15.0463 7.1900 137.1500 2.1956 229.5406 24.8569 448.1054 4.2173 2.5119 0.9388 0.4643 3.4084 2.4739 0.5147 7.2180 494.7823 450.4213 310.5262 223.2234 4.9247 34.2886 35.2647 29.2933 8.5545 9.3811 2.3995 21.9846 10.7346 11.8871 11.1841 10.2372 12.9553 10.7776 11.4701 8.0801 11.6863 14.8379 6.7576 2.7775 16.2250 14.2570 20.4707 5.0505 2.2860 1.5872 0.5159 10.6598 11.6611 2.4716 6.9903 15.7668 6.0790 2.7151 4.7291 390.5122 83.2219
temp: 333.150 k
press: 1.00000 atm
elementType: 6 6 6 6 6 6 1 1 1 1 6 6 1 1 1 6 6 6 6 1 6 1 6 1 1 6 1 1 1 6 8 8 6 1 1 1 46 11 8 6 8 6 1 7 6 1 6 1 8 6 8 8 1 1 1 1 6 1 1 6 6 1 6 6 6 6 6 6 1 6 6 1 6 6 1 1 6 1 1 1 1 8 6 8 6 1 1 1
symmnumber: 1
zpe: 1818877.2 jmol-1
zpe.correction: 0.692774 hartree
zpe.thermalcorrener: 0.751475 hartree
zpe.thermalcorrenthalpy: 0.752530 hartree
zpe.thermalcorrgfe: 0.591356 hartree
zpe.sumelectzpe: -2487.706711 hartree
zpe.sumelectthermal: -2487.648009 hartree
zpe.sumelectthermalent: -2487.646954 hartree
zpe.sumelectthermalfe: -2487.808128 hartree
dipole: -4.4762 -1.1594 -0.5113
dipole: 4.6521
quadrupole: -271.5835 -278.5449 -292.7191
quadrupole: -4.1604 4.7887 -5.6275
quadrupole: 9.3657 2.4042 -11.7700 -4.1604 4.7887 -5.6275
hfenergy: -2488.3994843 hartree
pointgroup: C01 [X(C38H38N1Na1O9Pd1)]
dipole: -1.7610676 -0.4561627 -0.2011546 debye
polarizability: 491.9967667|-65.4595195|458.4148099|27.4353146|-47.568308|479.9035221 unknown
InChI: InChI=1/C19H18NO5.C17H17O2.C2H3O2.Na.Pd/c1-11(21)17(18(22)23)20-19(24)25-10-16-14-8-4-2-6-12(14)13-7-3-5-9-15(13)16;1-12-4-8-14(9-5-12)17(3,16(18)19)15-10-6-13(2)7-11-15;1-2(3)4;;/h2-9,11,16-17,20-21H,10H2,1H3;4-11H,1-3H3;1H3;;/q-2;2*-1;2*+2/rC38H38NNaO9Pd/c1-22-14-17-26(18-15-22)38(5)32-19-16-23(2)20-33(32)50(47-25(4)41)48-35(42)34-24(3)44-40(45-36(38)49(40)50)46-37(39-34)43-21-31-29-12-8-6-10-27(29)28-11-7-9-13-30(28)31/h6-20,24,31,33-34,39,44H,21H2,1-5H3
charge 0 multiplicity 1
88 atoms
C  2.530302 -3.50886 4.379596
C  2.29105 -2.680168 3.289729
C  3.068256 -1.53096 3.060329
C  4.092103 -1.256716 3.968882
C  4.331106 -2.090198 5.067307
C  3.555769 -3.227539 5.297157
H  1.908967 -4.397402 4.527492
H  1.486366 -2.92913 2.593752
H  4.73206 -0.38406 3.829513
H  5.142546 -1.845711 5.758829
C  2.846521 -0.681125 1.812118
C  3.791024 -4.116965 6.488174
H  2.986364 -4.004856 7.232242
H  3.815612 -5.178067 6.197692
H  4.740484 -3.876716 6.986599
C  3.467126 -1.343365 0.571369
C  3.509741 -0.652338 -0.663717
C  4.005407 -2.633899 0.609038
C  4.033807 -1.283226 -1.804513
H  3.93136 0.610277 -0.683979
C  4.527659 -3.238628 -0.538399
H  4.028504 -3.189062 1.547459
C  4.540779 -2.585906 -1.774301
H  4.05416 -0.718505 -2.743375
H  4.939929 -4.249285 -0.462892
C  3.416481 0.742765 1.998288
H  3.084504 1.413004 1.191958
H  4.515523 0.730185 1.976703
H  3.074321 1.158798 2.956658
C  1.331021 -0.479809 1.584732
O  0.920005 -0.128877 0.408616
O  0.52644 -0.612007 2.510395
C  5.064725 -3.25118 -3.01774
H  4.238125 -3.635336 -3.636371
H  5.633638 -2.545435 -3.640227
H  5.718515 -4.100362 -2.77387
Pd 1.980512 0.702394 -1.066888
Na -1.356957 -0.325889 1.174542
O  -0.579536 0.10154 -2.509253
C  -0.647637 1.18549 -1.959601
O  0.327177 1.846791 -1.417012
C  -2.000124 1.924524 -1.82183
H  -1.983893 2.738052 -2.562601
N  -3.107287 1.064026 -2.193479
C  -2.118412 2.608338 -0.425713
H  -3.551334 1.177547 -3.09823
C  -3.296784 -0.113854 -1.569118
H  -1.670082 3.610111 -0.55038
O  -1.402419 1.933694 0.588989
C  -3.556828 2.758729 0.023139
O  -2.714546 -0.46668 -0.556322
O  -4.241215 -0.873592 -2.138172
H  -0.467782 1.93618 0.291169
H  -4.005774 1.769129 0.197232
H  -3.597575 3.325966 0.96335
H  -4.158671 3.279711 -0.735487
C  -4.466469 -2.135089 -1.522467
H  -5.201996 -2.619753 -2.175823
H  -3.535067 -2.723544 -1.549306
C  -4.993863 -2.082295 -0.071664
C  -5.666693 -0.794335 0.354095
H  -5.743479 -2.892331 0.007465
C  -3.98714 -2.301173 1.040069
C  -6.614612 -0.028568 -0.318911
C  -5.202127 -0.397308 1.622885
C  -2.987032 -3.262208 1.146493
C  -4.143025 -1.323981 2.042066
C  -7.117887 1.121316 0.300378
H  -6.95804 -0.315817 -1.31573
C  -5.716911 0.740225 2.247742
C  -2.124584 -3.226933 2.250953
H  -2.849965 -4.020157 0.370452
C  -3.297168 -1.300628 3.155649
C  -6.68168 1.495033 1.577022
H  -7.861221 1.732172 -0.216478
H  -5.360851 1.043534 3.235388
C  -2.278136 -2.255954 3.249153
H  -1.318838 -3.95979 2.333218
H  -3.409594 -0.534879 3.927584
H  -7.091371 2.391955 2.046571
H  -1.578307 -2.227976 4.086492
O  3.003564 1.692142 -2.477723
C  4.155685 2.078018 -2.103556
O  4.694334 1.693498 -1.033208
C  4.884078 3.052274 -2.987172
H  4.814409 4.04908 -2.527912
H  5.946187 2.783179 -3.039406
H  4.432407 3.085298 -3.98428
