program: Gaussian 16
title: mn15/BS1
version: ES64L-G16RevC.01
method: RMN15
basis: GenECP
operation: Freq
keyword: #P
keyword: freq=noraman
keyword: MN15/genecp
keyword: temperature=333.15
keyword: nosymm
title: #P freq=noraman MN15/genecp temperature=333.15 nosymm
basis: NPDir=0 NMtPBC= 1 NCelOv= 1 NCel= 1 NClECP= 1 NCelD= 1
basis: NCelK= 1 NCelE2= 1 NClLst= 1 CellRange= 0.0.
basis: One-electron integrals computed using PRISM.
converged: YES YES NO NO
title: Mulliken charges:
elementType: C C C C C C H H H H C C H H H C C C C H C H C H H C H H H C O O C H H H Pd Na O C O C H N C H C H O C O O H H H H C H H C C H C C C C C C H C C H C C H H C H H H H O C O C H H H
charge: -0.015795 0.006833 0.052381 0.025524 -0.026781 -0.043552 -0.041726 -0.039680 -0.022878 -0.041994 -0.256801 0.083890 0.019253 0.008675 0.033794 0.060617 -0.057057 0.020494 -0.006884 0.241552 -0.003007 -0.021862 -0.024714 -0.024637 -0.034670 0.135652 0.036527 0.023398 0.069617 0.276315 -0.347495 -0.274970 0.088229 0.036487 0.014164 0.019098 0.096409 0.300124 -0.302243 0.258578 -0.345452 0.041122 0.024614 -0.111229 0.075067 0.146955 0.251639 0.002330 -0.283413 0.083383 -0.264461 -0.284261 0.207660 0.018132 0.001857 -0.005734 0.264661 0.027300 0.037953 0.001026 -0.036863 0.033329 -0.013627 -0.019001 0.084690 -0.002434 0.097726 0.020606 -0.043444 0.000111 0.002718 -0.030937 -0.019888 0.016511 -0.017701 -0.036617 -0.002866 0.012888 -0.024649 -0.017676 0.013966 -0.298407 0.133687 -0.274744 0.077421 0.044164 0.039695 0.051326
chargesum: -0.00000
title: Mulliken charges with hydrogens summed into heavy atoms:
elementType: C C C C C C C C C C C C C C C C O O C Pd Na O C O C N C C O C O O C C C C C C C C C C C C C C O C O C
charge: -0.057521 -0.032846 0.052381 0.002645 -0.068775 -0.043552 -0.256801 0.145611 0.060617 0.184495 -0.001368 -0.031521 -0.037677 -0.024714 0.265195 0.276315 -0.347495 -0.274970 0.157978 0.096409 0.300124 -0.302243 0.258578 -0.345452 0.065737 0.035727 0.077397 0.251639 -0.075753 0.097638 -0.264461 -0.284261 0.329914 0.034354 -0.036863 -0.013627 -0.062445 0.084690 -0.033371 0.097726 0.002905 -0.036506 0.015607 -0.044537 -0.001165 0.011100 -0.298407 0.133687 -0.274744 0.212605
chargesum: 0.00000
polarizability: 4.96607933e+02 -8.13336492e+01 4.76662582e+02 4.18439731e+01 -5.61205691e+01 4.67324514e+02
1716.lowfreq: -1085.5245 -6.1780 -1.3818 -0.0005 0.0006 0.0007 4.6262 10.6451 14.0272
frequency: -1085.5245 10.4154 13.6454 18.2817 19.0754 22.8609 31.2862 34.9781 39.3338 41.1746 47.1765 51.3858 56.1211 63.0346 63.9537 70.4530 82.7484 87.5226 89.9005 99.9141 106.5150 116.2457 118.6959 122.1016 127.6055 133.9531 152.6285 154.2125 155.2909 165.9945 175.8412 178.9197 186.6298 189.5327 211.1779 211.7886 228.2158 229.7703 235.2467 250.2501 256.3367 257.3731 269.2658 276.2664 282.0429 290.9876 296.6396 303.2912 308.7868 310.3805 322.4769 328.2918 330.9643 344.2599 350.0289 366.0624 370.9080 378.1398 399.1345 402.3248 414.9649 422.3571 425.4325 433.6268 453.1559 456.0261 459.4683 472.9704 475.0588 508.2897 512.1349 541.9468 549.9068 554.4737 558.6542 560.9787 569.7643 579.1023 580.0466 583.8742 614.1895 614.9879 625.5142 637.3728 668.6780 677.5374 682.1735 688.8182 704.2035 719.8604 727.3903 737.8974 741.3799 760.4592 760.6259 769.2040 775.7105 785.7152 792.4242 798.1728 800.0080 805.3379 816.8297 846.1543 848.8138 856.6147 861.6772 862.1074 868.5232 870.5684 894.8950 905.5814 909.5330 923.2377 926.2200 936.2081 954.0935 976.5239 981.4178 984.5915 986.3986 986.6522 987.9613 988.1972 1006.7070 1008.6626 1010.9100 1012.7864 1015.8772 1021.5121 1028.0733 1030.2469 1031.8520 1035.0194 1042.5066 1043.3642 1045.6974 1047.0324 1050.2318 1058.2213 1073.6636 1088.8761 1090.0657 1102.0781 1117.4290 1122.1138 1124.7160 1139.4460 1144.1386 1148.3555 1150.4194 1157.5539 1179.8826 1185.7206 1185.8777 1197.9089 1215.2707 1218.8430 1227.3616 1243.5392 1244.6296 1247.1717 1248.7257 1269.5281 1284.6882 1286.3481 1287.5400 1294.0402 1306.2841 1306.8847 1322.4229 1330.0177 1336.6440 1338.5601 1341.5475 1355.2524 1357.2143 1358.7586 1373.7205 1375.3673 1376.8813 1378.6652 1378.8756 1388.5981 1402.3173 1408.4044 1419.7342 1424.8369 1425.7959 1427.1754 1429.6918 1435.6634 1436.1524 1437.1389 1437.8076 1443.1536 1444.8931 1455.1017 1456.1989 1457.5733 1482.2180 1487.2676 1487.7863 1519.0861 1524.7396 1538.9628 1539.2478 1559.1338 1584.2808 1634.1092 1655.8009 1660.1656 1671.0086 1682.3095 1690.4520 1698.7951 1705.2062 1728.2027 1736.2144 1760.1456 1847.3697 3027.1719 3069.3259 3071.4688 3072.9778 3073.5477 3075.7109 3101.5988 3109.5801 3115.3571 3154.2442 3157.5093 3166.8202 3166.9463 3179.9034 3182.7752 3183.1432 3186.1805 3187.8001 3196.6395 3197.7807 3208.4914 3210.5375 3211.7225 3215.9702 3216.7041 3226.3479 3227.0918 3237.3228 3238.3794 3238.7867 3238.8515 3245.1294 3247.1137 3248.3928 3248.6205 3662.6365 3688.3215
redmass: 1.1717 5.2490 6.0557 1.1749 4.1164 1.0450 3.8530 6.0450 4.5180 1.2537 4.7298 5.0386 3.6500 3.9637 5.1377 6.9308 5.5375 5.2800 4.6070 4.1770 5.1836 7.5860 7.1336 6.1106 6.9972 4.6273 4.8726 6.4489 7.0384 4.9209 5.8435 7.8535 6.4320 6.6133 4.9906 4.9677 4.3345 4.4706 6.3257 6.8689 2.3621 4.0939 5.6651 4.3950 2.1663 2.6635 3.0238 3.1692 3.8720 2.9532 4.8872 3.0239 3.4687 2.8090 3.6100 3.6603 5.0415 6.6247 4.5343 4.4294 6.3994 2.9381 3.2413 3.2748 4.8647 3.3573 3.7653 5.1282 4.0004 3.0859 4.5755 3.5919 2.5224 2.6242 2.4858 3.8027 4.6843 4.2370 4.1217 3.4904 4.5168 6.7749 2.6775 6.7642 1.4778 5.9092 3.9205 4.6550 4.1321 6.1308 2.3252 4.7149 3.1906 1.5686 4.1700 2.0147 2.6587 8.4154 3.8616 2.8100 2.5283 3.3891 2.1421 2.2845 4.7447 2.1181 1.3036 3.0078 1.8820 3.5536 2.6471 1.4965 1.7730 2.2523 1.3407 2.7565 2.3694 3.9569 1.4000 1.7390 1.3960 1.4925 1.4271 1.5641 3.9865 1.5475 1.4231 1.4059 2.6765 2.7036 1.5844 1.6167 1.3552 3.0074 1.9059 1.6309 1.8718 1.6637 1.8812 2.5353 2.5124 1.9121 2.2643 2.0233 1.7404 1.4828 1.9192 1.6388 1.2365 1.3030 1.0947 1.2175 1.2134 1.5644 1.1576 2.3882 1.6746 1.6858 2.2260 1.7466 2.1483 1.5350 3.0907 1.6385 1.6110 1.7690 4.2912 1.5747 1.2889 2.2629 2.3633 1.6843 2.0988 1.6384 1.3106 1.3182 1.4498 7.0315 1.9798 2.0718 2.5278 1.4094 1.3812 1.3308 5.0918 1.1517 3.2597 1.1053 1.4587 1.0489 1.3725 1.0598 1.0516 1.0934 1.1130 1.6574 1.1402 1.0983 1.6828 1.8755 2.6763 3.2693 7.5913 3.3107 4.0309 5.0196 4.5321 3.3037 3.3849 6.9823 7.2100 7.2497 7.7084 7.0031 7.8854 7.7348 7.2462 7.3739 11.1947 10.3537 11.4154 1.0846 1.0376 1.0387 1.0364 1.0389 1.0842 1.0367 1.0634 1.0857 1.1018 1.1016 1.1044 1.1030 1.1044 1.1033 1.1047 1.1066 1.1062 1.0913 1.1020 1.0901 1.0909 1.0905 1.0886 1.0901 1.0898 1.0890 1.1081 1.0948 1.0946 1.0948 1.0933 1.0994 1.0931 1.0989 1.0777 1.0648
irintensity: 2364.9833 0.1132 0.2683 1.1949 0.3286 0.4803 0.0728 0.1371 1.0084 0.2282 0.3548 0.7167 0.7978 1.2747 0.5974 0.3523 2.1748 0.5899 0.4820 0.5262 3.9255 4.8065 5.8508 0.8995 3.4838 0.6836 2.8629 1.6312 6.1438 0.6581 2.3802 3.3856 6.6282 0.9060 1.6791 2.8657 0.6042 3.4983 7.5081 9.1754 15.3324 0.2228 11.2547 5.9834 3.7796 5.4202 5.4529 4.0976 11.4228 6.2423 10.5579 3.5557 8.9575 13.0501 1.5932 5.1468 34.4280 27.8788 13.0668 17.1100 0.0632 2.2246 21.3571 1.9502 0.7162 2.5610 7.5507 29.8029 2.2958 9.2709 1.3816 16.2871 36.6832 33.0175 18.3565 4.6643 41.9465 5.9992 0.8899 0.6540 7.1756 4.5522 3.6141 0.0131 76.7679 19.8452 25.6492 21.8952 9.7651 66.3399 71.3875 1.4353 1.4508 18.7064 14.4945 34.4955 52.1011 50.7940 6.2736 32.6661 12.3459 1.6428 0.1911 10.0932 35.7811 14.2782 0.4566 21.0283 0.8259 7.3982 7.9019 1.4758 1.0113 10.9594 9.9762 29.6875 2.4634 18.9980 1.6658 6.6680 3.9120 1.5926 2.4725 2.1013 0.1287 0.8508 0.3925 0.7297 13.0668 4.4861 5.1882 5.6937 0.1864 12.4474 5.6785 7.5977 2.7075 6.2819 0.5902 10.9203 17.6135 26.5771 25.4837 16.1958 5.6631 2.3624 6.8579 24.4928 1.1544 24.4804 0.1989 0.8816 414.0404 11.2957 10.3160 33.0026 11.7483 9.3834 9.1047 0.7762 1.7010 4.9216 4.1790 17.7597 6.1743 8.6665 14.4566 134.4985 3.7420 255.1997 7.6666 48.7567 60.9485 7.7807 0.6584 32.8461 26.4491 4.9846 21.0100 3.7324 16.4632 0.4444 0.7125 1.5383 0.3049 47.2536 301.7132 15.2372 3.0746 8.0442 8.0313 6.9481 5.8499 29.7292 4.0827 39.1050 24.9654 9.8709 10.1521 14.1241 20.1889 47.4294 276.9109 4.4969 157.7240 187.9730 9.7559 28.5665 433.6018 3.3801 1.6424 0.5844 0.8980 1.9271 3.2274 0.2051 4.6836 539.1492 163.0398 797.0838 340.9027 53.8198 14.6206 35.6431 8.4705 27.8932 4.8443 2.4698 28.8346 13.0595 12.1181 11.2502 19.7290 10.8087 12.6256 11.8367 9.3898 12.8280 7.9960 8.0132 1.5501 16.4938 14.2575 19.4272 2.8173 7.4338 5.1750 1.4393 3.1873 5.8983 11.8547 9.1704 5.7229 13.3486 2.9813 3.1439 54.1294 338.3344
temp: 333.150 k
press: 1.00000 atm
elementType: 6 6 6 6 6 6 1 1 1 1 6 6 1 1 1 6 6 6 6 1 6 1 6 1 1 6 1 1 1 6 8 8 6 1 1 1 46 11 8 6 8 6 1 7 6 1 6 1 8 6 8 8 1 1 1 1 6 1 1 6 6 1 6 6 6 6 6 6 1 6 6 1 6 6 1 1 6 1 1 1 1 8 6 8 6 1 1 1
symmnumber: 1
zpe: 1818454.8 jmol-1
zpe.correction: 0.692613 hartree
zpe.thermalcorrener: 0.751414 hartree
zpe.thermalcorrenthalpy: 0.752469 hartree
zpe.thermalcorrgfe: 0.589420 hartree
zpe.sumelectzpe: -2487.708810 hartree
zpe.sumelectthermal: -2487.650009 hartree
zpe.sumelectthermalent: -2487.648954 hartree
zpe.sumelectthermalfe: -2487.812002 hartree
dipole: -3.0051 -0.3565 -2.1067
dipole: 3.6873
quadrupole: -276.0674 -277.8567 -292.5420
quadrupole: -2.9944 5.6399 -5.3254
quadrupole: 6.0880 4.2986 -10.3866 -2.9944 5.6399 -5.3254
hfenergy: -2488.4014228 hartree
pointgroup: C01 [X(C38H38N1Na1O9Pd1)]
dipole: -1.1823096 -0.1402429 -0.8288416 debye
polarizability: 496.6079326|-81.3336492|476.6625821|41.8439731|-56.1205691|467.324514 unknown
InChI: InChI=1/C19H18NO5.C17H17O2.C2H3O2.Na.Pd/c1-11(21)17(18(22)23)20-19(24)25-10-16-14-8-4-2-6-12(14)13-7-3-5-9-15(13)16;1-12-4-8-14(9-5-12)17(3,16(18)19)15-10-6-13(2)7-11-15;1-2(3)4;;/h2-9,11,16-17,20-21H,10H2,1H3;4-11H,1-3H3;1H3;;/q-3;2*-1;+3;+2/rC38H38NNaO9Pd/c1-22-14-17-26(18-15-22)37(5)32-19-16-23(2)20-33(32)50(46-25(4)42)47-35-34(24(3)41)39-36(45-40(44-35)38(37,48-40)49(40)50)43-21-31-29-12-8-6-10-27(29)28-11-7-9-13-30(28)31/h6-20,24,31,33-34,39,41H,21H2,1-5H3
charge 0 multiplicity 1
88 atoms
C  4.979493 -2.662306 4.772172
C  4.534737 -1.843819 3.729503
C  3.48109 -2.235887 2.900145
C  2.887863 -3.483823 3.150137
C  3.332174 -4.298006 4.186999
C  4.38655 -3.901598 5.02424
H  5.808748 -2.326617 5.401607
H  5.036262 -0.888664 3.564182
H  2.064874 -3.823509 2.517712
H  2.850064 -5.265697 4.354919
C  3.06331 -1.39625 1.697452
C  4.841039 -4.775882 6.161915
H  4.915033 -5.829431 5.853743
H  5.82217 -4.460138 6.543437
H  4.129426 -4.734419 7.002084
C  3.761799 -1.879731 0.421352
C  3.648323 -1.132128 -0.772803
C  4.512607 -3.060115 0.3800
C  4.243673 -1.600132 -1.958661
H  3.843471 0.170109 -0.708525
C  5.098178 -3.50322 -0.808349
H  4.650921 -3.650987 1.286585
C  4.968134 -2.79292 -2.0080
H  4.144154 -0.990779 -2.864105
H  5.678428 -4.430894 -0.797466
C  3.347938 0.104963 1.944442
H  4.421026 0.326048 1.853855
H  2.99853 0.380974 2.949159
H  2.819061 0.737819 1.2153
C  1.533844 -1.45748 1.502481
O  1.049274 -1.247778 0.320319
O  0.786461 -1.637434 2.467955
C  5.573276 -3.299882 -3.288851
H  4.937261 -4.074349 -3.746554
H  5.687637 -2.491486 -4.02444
H  6.561169 -3.750942 -3.115596
Pd 1.880932 -0.072312 -1.063216
Na -1.012445 -0.720652 1.349429
O  0.073079 0.762148 -1.520333
C  -0.637626 1.335717 -0.646728
O  -0.400838 1.409615 0.575919
C  -1.899359 2.02678 -1.216864
H  -1.5311 2.652814 -2.045188
N  -2.81677 1.059626 -1.793662
C  -2.582998 2.935184 -0.179372
H  -3.482156 1.380717 -2.490485
C  -3.083368 -0.140207 -1.240999
H  -1.854458 3.739796 0.048092
O  -2.902841 2.218373 0.983981
C  -3.858892 3.550642 -0.719595
O  -2.423378 -0.685754 -0.370282
O  -4.164632 -0.713264 -1.790693
H  -2.03623 1.891185 1.298158
H  -4.294237 4.227213 0.028713
H  -3.672995 4.118098 -1.644668
H  -4.599399 2.75899 -0.916638
C  -4.656245 -1.896525 -1.178168
H  -5.377825 -2.298272 -1.901167
H  -3.83753 -2.62275 -1.051184
C  -5.35265 -1.639314 0.173953
C  -6.023937 -0.283258 0.251021
H  -6.099497 -2.444324 0.296453
C  -4.439633 -1.617675 1.383287
C  -6.9827 0.274017 -0.592081
C  -5.518047 0.449596 1.338013
C  -3.572233 -2.605118 1.843183
C  -4.518474 -0.373782 2.031196
C  -7.453656 1.561799 -0.318234
H  -7.364185 -0.283217 -1.452003
C  -5.984794 1.737653 1.609888
C  -2.757061 -2.328859 2.947486
H  -3.506225 -3.573762 1.339797
C  -3.695245 -0.088182 3.123935
C  -6.962931 2.283314 0.77871
H  -8.212571 2.009566 -0.963783
H  -5.575299 2.310109 2.444775
C  -2.812503 -1.074499 3.577114
H  -2.05655 -3.082278 3.314329
H  -3.735114 0.89125 3.606666
H  -7.341544 3.289151 0.974645
H  -2.157038 -0.873123 4.427795
O  2.67711 1.197857 -2.39551
C  3.755517 1.756447 -2.016208
O  4.387331 1.40395 -0.988519
C  4.282484 2.892366 -2.849298
H  5.339285 2.709568 -3.083812
H  3.694391 3.01295 -3.764882
H  4.234817 3.81358 -2.251699
