program: Gaussian 09
title: 000075715
version: EM64L-G09RevD.01
frameworkgroup: C1[X(C9H12O2)]
method: RPBEPBE
basis: SDD
operation: Freq
keyword: #pfreq=noraman
keyword: PBEPBE/SDD
title: #p freq=noraman PBEPBE/SDD
converged: YES YES NO NO
title: Mulliken charges:
elementType: O O C C C C C C C C C H H H H H H H H H H H H
charge: -0.244770 -0.411000 0.259779 0.479436 -0.482687 0.130070 -0.440121 -0.348469 -0.242120 -0.815977 -0.684422 0.247844 0.229696 0.214810 0.205268 0.205140 0.226862 0.226630 0.223070 0.202390 0.234027 0.234014 0.350529
chargesum: 0.00000
title: Mulliken charges with hydrogens summed into heavy atoms:
elementType: O O C C C C C C C C C
charge: -0.244770 -0.060470 0.259779 0.479436 -0.234844 0.130070 -0.210425 -0.133659 0.168287 -0.139415 -0.013990
polarizability: 1.40185029e+02 -1.44125882e+00 1.21392752e+02 1.49287433e-02 3.90234314e-03 5.77423969e+01
1716.lowfreq: -7.6677 0.0008 0.0008 0.0009 2.5825 9.0732 58.6650 66.5752 107.8568
frequency: 58.6474 66.5742 107.8488 126.3580 138.0690 216.9672 237.6035 267.5936 312.3441 328.8934 348.3708 353.7971 445.7812 453.7063 520.4632 575.6186 590.9651 701.9348 720.7336 769.1919 788.2096 822.5033 854.0469 860.4873 904.9487 951.8526 1007.5086 1034.4545 1046.4709 1088.2149 1115.8489 1134.9975 1154.2925 1170.3554 1240.4023 1260.2415 1270.6571 1296.6110 1364.4621 1395.7459 1398.1870 1404.0314 1411.5362 1458.9106 1471.1752 1476.4173 1477.8175 1488.4673 1515.1639 1604.5653 1618.7978 2948.3964 2972.2860 2997.4019 3005.4026 3048.1168 3081.6027 3094.4576 3107.8705 3108.1956 3141.8634 3146.6107 3575.5306
redmass: 1.2100 2.5475 1.5878 3.4302 3.9289 3.3761 1.3265 3.3518 4.0439 1.1974 3.3762 3.4180 3.0414 5.8558 3.6011 6.1057 3.6508 5.5132 3.2315 5.2432 1.3945 1.1540 1.3579 3.3326 1.3380 2.5518 1.6565 2.6920 1.5125 2.1599 2.1795 1.4354 1.4838 1.5267 2.0981 1.1443 3.7689 1.4466 1.3562 1.6928 1.2537 2.4299 3.7505 1.0398 1.0456 1.0674 1.1251 1.0925 2.8677 6.3447 6.6577 1.0551 1.0373 1.0363 1.1073 1.0978 1.0983 1.0988 1.1012 1.0884 1.0917 1.0940 1.0659
irintensity: 0.1588 4.2895 3.2267 1.8586 1.4646 2.7262 0.4636 2.9198 2.6595 98.9641 4.5599 38.1921 4.4412 0.4592 9.1974 4.5849 10.7211 2.1153 1.7125 21.7484 53.6504 13.0806 7.9562 2.5159 0.3541 28.9043 11.2071 53.9591 11.4696 191.8590 14.7081 4.4618 3.8919 164.0187 42.3661 0.0489 173.3721 14.6433 6.6291 6.1799 12.8109 22.8980 23.3320 11.2379 13.0022 14.8045 18.0503 18.9458 119.0092 51.1913 0.5670 39.3816 48.3898 26.1883 40.5780 25.1347 21.6149 28.7965 33.6471 20.0241 27.9441 3.7691 30.2128
temp: 298.150 k
press: 1.00000 atm
elementType: 8 8 6 6 6 6 6 6 6 6 6 1 1 1 1 1 1 1 1 1 1 1 1
symmnumber: 1
zpe: 494396.1 jmol-1
zpe.correction: 0.188306 hartree
zpe.thermalcorrener: 0.199932 hartree
zpe.thermalcorrenthalpy: 0.200876 hartree
zpe.thermalcorrgfe: 0.150675 hartree
zpe.sumelectzpe: -499.752582 hartree
zpe.sumelectthermal: -499.740955 hartree
zpe.sumelectthermalent: -499.740011 hartree
zpe.sumelectthermalfe: -499.790212 hartree
dipole: 0.8892 -1.1170 0.0040
dipole: 1.4278
quadrupole: -60.3101 -54.0098 -69.2136
quadrupole: 7.8847 0.0033 0.0137
quadrupole: 0.8677 7.1681 -8.0357 7.8847 0.0033 0.0137
hfenergy: -499.9408871 hartree
pointgroup: C01 [X(C9H12O2)]
dipole: -0.3719749 -0.4207675 0.0110596 debye
dipolederiv: -1.6987244 0.4675043 -0.0709386 0.5074924 -0.4671529 0.0272383 -0.072788 0.0260213 -0.2672703 -0.4463773 -0.6739442 0.0375281 -0.6232562 -0.994526 0.0148373 0.0342988 0.0129334 -0.3906116 1.4718461 -0.295637 0.0594078 -0.3405216 -0.0879368 -0.000375 0.0616502 0.00132 0.0913894 0.066437 0.0153782 0.0025505 0.242048 0.2301786 -0.0076666 -0.0093806 -0.0135019 -0.0376298 -0.2511518 0.0326506 -0.0023634 -0.2022653 -0.0235933 -0.0180342 0.011019 -0.011105 -0.2307709 0.132409 0.6025854 -0.0308675 0.7882818 0.9065007 -0.0270574 -0.0415273 -0.0327309 0.0097214 -0.0659153 0.0773652 -0.0002876 -0.223069 -0.0987481 -0.0127974 0.0165901 -0.0034559 -0.1998565 0.0053477 -0.2465835 0.0198951 0.0646058 -0.0230291 -0.0070491 0.001971 -0.0169925 -0.1811857 0.6763201 -0.2341173 0.0218909 -0.6192371 0.5931577 -0.0300583 0.0442585 -0.0183107 0.4029861 0.0483484 -0.0287711 0.0005436 -0.0869191 -0.0539614 0.0050207 0.0027612 0.0054026 0.0817954 -0.143901 0.0086895 -0.0062046 0.0404091 0.0612516 0.0009321 -0.0079457 -0.0001275 0.0520799 0.0777725 0.0728971 -0.0066276 0.0938824 -0.0666132 0.0157748 -0.0078745 0.015179 0.1556277 -0.1338476 0.018534 -0.0101575 0.0064687 0.0821801 0.00494 -0.0092615 0.0052697 0.1630076 0.0606091 0.0382051 -0.0055071 0.0563896 -0.1447688 0.0197659 -0.0065583 0.0192266 0.167849 -0.0270425 -0.0516588 0.0922426 0.0892681 -0.0592966 0.0815614 0.0427561 0.108264 -0.1016645 -0.0190356 -0.0550398 -0.0816785 0.0886442 -0.0817404 -0.0789585 -0.0488234 -0.1142876 -0.0873465 0.0596869 0.0032723 0.0601861 -0.0444028 -0.0576886 -0.1037123 0.0014167 -0.1470496 -0.0369716 0.0625587 -0.0098271 -0.0543353 -0.0487298 -0.0303898 0.1003565 0.0095742 0.1461915 -0.0662955 -0.1524026 -0.0018351 -0.0065582 0.1083749 0.0604588 0.0053378 -0.0127097 0.002658 0.1063755 -0.0131112 0.0892415 -0.0089323 0.1364137 -0.1118962 0.0168694 -0.0116369 0.0154484 0.1112692 0.0650362 -0.0192279 0.0387372 -0.082739 0.0628661 0.0899501 0.0764176 0.0833388 -0.0668601 0.0707103 -0.0177871 -0.0292018 -0.0846988 0.0411062 -0.1077999 -0.0594642 -0.0972563 -0.0510681 0.1544273 0.2081057 -0.0193218 0.1335597 0.2636414 0.0109245 -0.0147433 0.0135647 0.3754299 unknown
polarizability: 140.2051075|0.6035489|121.0878195|2.5177965|-3.6111488|58.0272513 unknown
InChI: InChI=1S/C9H12O2/c1-3-11-9-6-7(2)4-5-8(9)10/h4-6,10H,3H2,1-2H3
charge 0 multiplicity 1
23 atoms
O  1.783937 0.145922 0.159065
O  0.730381 2.603974 -0.013844
C  0.386591 0.2127 0.112613
C  -1.892291 -0.749888 0.097347
C  -0.479767 -0.90269 0.149982
C  -0.170311 1.524568 0.020078
C  -2.425318 0.553755 0.006083
C  -1.568708 1.681152 -0.032144
C  2.398898 -1.191207 0.255428
C  -2.794279 -1.972754 0.138885
C  3.909616 -0.975665 0.287741
H  -0.063176 -1.912977 0.221137
H  -3.510436 0.69834 -0.035317
H  -1.996164 2.69047 -0.103263
H  2.043262 -1.697443 1.177199
H  2.09747 -1.802434 -0.620977
H  -2.595589 -2.652258 -0.711814
H  -2.641746 -2.558111 1.065677
H  -3.859155 -1.68611 0.095994
H  4.431467 -1.947548 0.35863
H  4.246772 -0.460227 -0.627466
H  4.194548 -0.357946 1.156164
H  0.230497 3.455779 -0.079998
