program: Gaussian 16
title: MN15/BS1
version: ES64L-G16RevC.01
method: RMN15
basis: GenECP
operation: Freq
keyword: #N
keyword: Geom=AllCheck
keyword: Guess=TCheck
keyword: SCRF=Check
keyword: GenChk
keyword: RMN15/GenECP
keyword: Freq
converged: YES YES NO YES
title: Mulliken charges:
elementType: C C C C C C H H H H C C C C C C H C H H C O O Pd Na C H C H H C O O C H O H C H H H C H H H C H H H C H H H C H H C H H H
charge: -0.004746 0.083050 0.044312 0.009299 -0.012653 -0.047603 -0.053830 -0.011013 -0.017825 -0.039488 -0.297514 0.064404 0.052495 -0.025221 -0.121761 -0.023642 -0.037684 -0.017299 -0.047730 -0.048498 0.250528 -0.324372 -0.293541 -0.377181 0.660552 0.142363 0.028561 0.055273 0.033714 0.012849 0.207788 -0.326541 -0.378602 0.075118 -0.017676 -0.294786 0.210799 0.095601 0.006833 0.026352 0.025642 0.091195 0.014200 0.013124 0.034407 0.228155 0.015835 -0.000621 0.008786 0.096066 0.032070 0.048940 0.043333 -0.000968 -0.003414 0.048636 0.067743 0.009548 -0.010451 -0.002910
chargesum: -0.00000
title: Mulliken charges with hydrogens summed into heavy atoms:
elementType: C C C C C C C C C C C C C C O O Pd Na C C C O O C O C C C C C C
charge: -0.058575 0.072038 0.044312 -0.008526 -0.052141 -0.047603 -0.297514 0.064404 0.052495 -0.062905 -0.169491 -0.072141 -0.017299 0.250528 -0.324372 -0.293541 -0.377181 0.660552 0.170924 0.101835 0.207788 -0.326541 -0.378602 0.057442 -0.083986 0.154428 0.152925 0.252155 0.220409 0.044254 0.063930
1716.lowfreq: -147.0963 -4.6893 0.0007 0.0009 0.0010 4.3067 7.4512 32.6069 36.7445
frequency: -147.0961 32.5830 36.7182 43.8991 49.9918 57.9128 58.5595 65.2667 71.8706 80.3796 86.3938 92.4483 105.5295 116.0561 121.3829 125.3189 127.8534 140.1437 145.4685 160.6433 169.0185 175.5998 192.4590 198.3250 213.5458 228.9737 235.1732 239.7166 248.3919 251.9341 263.1153 280.1405 308.3474 318.2106 343.6499 351.1901 368.3981 370.6118 388.8179 412.6996 425.8317 440.5024 445.7814 453.9221 468.4817 477.4530 496.7205 509.3159 525.7029 546.3353 559.2146 575.9913 584.7552 596.8799 604.5131 614.5978 634.4417 661.4522 685.6207 723.2877 731.7420 737.1709 748.2525 773.3976 783.6298 819.5744 837.4682 837.9310 842.8822 863.6809 866.7561 888.4836 916.6716 930.6652 934.2283 983.1729 984.2665 987.6412 989.2055 997.9533 1000.8487 1000.9866 1010.5007 1011.8652 1016.2836 1038.4280 1039.8655 1041.7155 1046.8112 1071.5474 1076.1015 1104.6285 1117.4010 1119.4126 1127.2547 1139.2067 1159.8002 1182.3700 1186.2721 1194.8914 1223.8460 1234.4109 1243.1631 1251.4793 1259.4389 1265.0940 1278.6591 1286.1105 1304.4529 1313.6034 1328.8430 1340.3893 1343.0640 1356.8550 1359.7818 1367.7094 1373.8000 1377.3578 1382.3277 1389.1809 1402.9765 1405.0057 1405.3304 1407.1812 1416.0431 1424.4992 1425.3474 1429.3329 1434.0044 1434.3157 1438.4111 1439.4830 1446.0986 1451.4465 1455.0999 1457.1201 1547.2449 1549.8406 1549.8881 1641.2555 1649.5938 1650.3413 1696.0326 1702.1839 1711.9271 3008.5977 3045.9306 3054.9818 3065.9428 3067.7722 3072.6586 3074.4494 3085.4634 3094.4876 3110.2569 3134.2987 3150.7043 3152.7371 3155.5598 3176.5862 3180.0912 3180.4961 3187.1576 3187.2830 3191.6642 3196.8910 3203.8495 3208.4168 3214.1043 3216.1194 3229.0522 3233.2242 3284.5579 3787.6663
redmass: 1.8741 1.3781 2.4238 4.0916 4.1014 2.2131 1.7856 1.1999 4.3767 2.0666 3.4271 5.7280 5.1772 4.5956 4.8980 5.6189 6.4939 5.6067 6.6068 4.1519 2.5288 4.1063 6.2468 5.2592 6.5659 7.1711 1.9203 5.2939 2.5882 4.5243 4.3964 3.6772 7.7172 6.6410 3.5865 3.7487 2.8243 3.6248 4.0532 1.9845 3.0086 3.5925 4.8581 1.6763 2.1939 3.1161 4.1985 3.7543 1.8039 3.2762 2.2949 3.9281 3.6984 4.1736 2.4882 3.7526 6.7520 4.9202 6.1474 3.6040 4.0262 4.5539 3.1738 3.3143 1.3132 5.0522 1.5471 1.8572 1.4429 1.6553 1.3410 3.4153 2.3060 1.7028 3.1581 3.2389 1.5609 1.4461 1.3760 1.4076 1.3740 1.5392 1.2854 1.3580 2.7321 1.9513 1.6425 1.6346 2.8987 2.1064 2.7841 2.0340 2.2518 2.2197 1.4611 1.9556 1.8041 1.0947 2.1453 1.7611 3.2199 1.2423 2.1236 2.1765 2.9597 1.4615 1.2864 1.5356 1.3098 1.2642 1.4923 1.3200 1.4803 6.1383 1.3374 1.2808 1.8329 1.3870 1.8562 1.7483 1.2589 1.4911 1.0613 3.2386 1.7351 1.1295 1.2419 1.2004 1.0414 1.0547 1.0612 1.0596 1.0957 1.4162 1.4883 1.3087 3.4775 8.0417 3.4217 7.5291 7.6294 8.9091 7.1728 7.2161 12.2688 1.0832 1.0749 1.0762 1.0380 1.0398 1.0383 1.0643 1.0369 1.0388 1.0974 1.1000 1.1010 1.1033 1.1026 1.1029 1.1039 1.1047 1.0912 1.1051 1.0993 1.0881 1.1023 1.0895 1.0952 1.0922 1.0949 1.1084 1.0904 1.0659
irintensity: 1.8328 1.1691 0.5755 0.5909 0.7983 1.5382 0.5360 1.2603 2.8313 0.1092 2.0228 2.1089 1.2517 1.5703 0.6896 5.6245 2.0714 1.5603 0.9709 3.0462 1.1694 0.5980 21.9260 8.7323 17.4435 11.3608 10.5557 5.4517 2.8264 12.0848 30.4687 6.1027 5.1125 2.9565 0.3081 1.8231 0.4214 2.5366 5.5760 6.7699 0.3064 7.5299 28.7593 9.4733 5.1401 10.5378 14.8998 6.4209 38.3551 2.8200 61.1837 12.3035 6.6016 6.3844 6.8879 7.2919 0.3654 6.2799 100.1414 3.0363 2.9849 8.0575 9.0976 15.8122 0.4757 4.4089 3.2264 3.6169 18.2024 2.2461 1.2623 9.3750 15.0960 0.2444 1.1532 8.2362 3.7250 1.9337 3.8009 9.2219 0.5707 6.6419 5.7612 1.4184 6.3066 9.4797 7.1238 3.6523 6.6621 3.1238 6.2409 19.6398 38.4572 5.5135 1.6135 33.2085 4.2743 4.0248 55.5573 2.3499 0.4907 18.8533 1.3737 0.6174 0.8360 9.1621 6.1750 15.3999 1.1777 5.0259 3.0716 1.7951 2.2187 9.7823 10.8893 4.6444 0.7069 1.7052 1.3213 7.0389 32.6395 65.5852 30.1245 115.3810 43.9784 23.7025 22.6998 1.9712 5.9977 3.9494 9.1577 3.2487 20.0126 13.4573 3.2548 13.0654 69.8942 293.6274 93.4943 3.1459 52.0608 128.0305 4.9363 15.0436 576.0270 46.8343 14.5723 17.7921 31.1064 28.2438 33.5545 11.2527 14.9486 0.7307 8.9060 10.8593 31.4805 11.0070 11.3726 17.3100 8.2472 10.5281 17.5062 17.5922 4.9713 14.2561 14.0402 10.7114 4.9132 16.2578 3.2894 2.0347 4.4416 167.2560
temp: 333.150 k
press: 1.00000 atm
elementType: 6 6 6 6 6 6 1 1 1 1 6 6 6 6 6 6 1 6 1 1 6 8 8 46 11 6 1 6 1 1 6 8 8 6 1 8 1 6 1 1 1 6 1 1 1 6 1 1 1 6 1 1 1 6 1 1 6 1 1 1
symmnumber: 1
zpe: 1275512.7 jmol-1
zpe.correction: 0.485817 hartree
zpe.thermalcorrener: 0.525318 hartree
zpe.thermalcorrenthalpy: 0.526373 hartree
zpe.thermalcorrgfe: 0.410668 hartree
zpe.sumelectzpe: -1594.971413 hartree
zpe.sumelectthermal: -1594.931912 hartree
zpe.sumelectthermalent: -1594.930857 hartree
zpe.sumelectthermalfe: -1595.046562 hartree
dipole: -2.2121 -3.8078 1.5048
dipole: 4.6538
quadrupole: -177.6957 -175.5474 -209.1199
quadrupole: 16.6436 -8.5163 9.6002
quadrupole: 9.7586 11.9070 -21.6656 16.6436 -8.5163 9.6002
hfenergy: -1595.4572299 hartree
pointgroup: C01 [X(C24H29Na1O5Pd1)]
dipole: -0.8703197 -1.4981029 0.5920522 debye
polarizability: 368.4394892|2.0754506|281.4226537|-20.3495192|-16.2212538|262.976076 unknown
InChI: InChI=1/C22H26O3.C2H3O2.Na.Pd/c1-5-19(23)12-9-17-14-16(3)8-13-20(17)22(4,21(24)25)18-10-6-15(2)7-11-18;1-2(3)4;;/h6-8,10-14,19,23H,5,9H2,1-4H3;1H3;;/q-1;-2;+2;+1/rC24H29NaO5Pd/c1-6-21(26)22-14-18-13-16(3)9-12-20(18)23(5,19-10-7-15(2)8-11-19)24-25(29-24)27-17(4)28-31(22,25)30(24)25/h7-13,21-22,26H,6,14H2,1-5H3
charge 0 multiplicity 1
60 atoms
C  -1.78174812 1.17872461 2.29006594
C  -0.95773439 0.10755737 1.9517275
C  0.39299301 0.30930738 1.61848918
C  0.89707538 1.61071384 1.69998799
C  0.07257289 2.67853729 2.06498656
C  -1.28465187 2.48961054 2.34312423
H  -2.83380726 0.99295392 2.52935504
H  -1.36489862 -0.90851502 1.96677327
H  1.95197286 1.79392098 1.4796871
H  0.49393169 3.68689109 2.11795347
C  1.33386556 -0.88754247 1.40702232
C  2.58821403 -0.49866011 0.60418515
C  2.63007926 0.05661181 -0.70087507
C  3.8219899 -0.67015846 1.27038171
C  3.90557722 0.42285377 -1.19409868
C  5.05317672 -0.31368271 0.74323603
H  3.82404543 -1.10728502 2.26600889
C  5.11358762 0.26501768 -0.52628367
H  3.94451233 0.85833386 -2.19874427
H  5.96401527 -0.48098499 1.32459439
C  0.6054348 -2.06627586 0.73023181
O  0.48366521 -2.07691584 -0.56318318
O  0.13957732 -2.9801064 1.42787881
Pd -1.09063615 -0.8067285 -0.84326113
Na -1.40333031 -3.58276322 -0.09634604
C  0.08722133 0.22925485 -2.04261525
H  -0.07881741 -0.42701652 -2.9167881
C  1.60828334 0.34412857 -1.82986169
H  2.03226904 -0.25236506 -2.65338551
H  1.84486029 1.38570916 -2.1126612
C  -3.57060579 -0.87136288 -0.20352779
O  -3.02307741 0.06912667 -0.84993317
O  -2.90715431 -1.90667469 0.10947664
C  -0.57917477 1.56419353 -2.38057787
H  0.06482496 2.04670471 -3.14527365
O  -1.82388935 1.37698994 -3.00349983
H  -2.45602415 1.06993901 -2.33056554
C  6.42000356 0.68842307 -1.13990247
H  6.27607852 1.09852951 -2.14913076
H  6.91507178 1.458762 -0.5285596
H  7.11749295 -0.16005184 -1.21416464
C  -2.18815574 3.65121005 2.65620918
H  -2.96311026 3.3759009 3.38643483
H  -1.62243133 4.50392033 3.05761622
H  -2.70581919 3.99857829 1.74671673
C  1.64614616 -1.34983935 2.84585649
H  2.25276186 -2.26589578 2.86471607
H  2.15464166 -0.54996418 3.40206032
H  0.69785362 -1.57442416 3.34836734
C  -4.99646919 -0.72614019 0.24251404
H  -5.49882415 -1.70102085 0.24451281
H  -4.99152593 -0.34694526 1.27608278
H  -5.53041165 -0.0077095 -0.38938087
C  -0.66888909 2.49930734 -1.17958904
H  0.34509785 2.63680111 -0.77154488
H  -1.24557623 1.98462202 -0.38957769
C  -1.30231631 3.84274667 -1.50559408
H  -2.31234961 3.70199655 -1.9160603
H  -1.37505637 4.47766574 -0.60873797
H  -0.71470344 4.3900447 -2.2599739
