program: Gaussian 16
title: freeze mn15/BS1
version: ES64L-G16RevC.01
method: RMN15
basis: GenECP
operation: Freq
keyword: #N
keyword: Geom=AllCheck
keyword: Guess=TCheck
keyword: SCRF=Check
keyword: GenChk
keyword: RMN15/GenECP
keyword: Freq
converged: YES YES NO NO
title: Mulliken charges:
elementType: Pd C O C C C C C H H C O O C H H C C H C H H H C C C C H C H C H H Na C H H H C H H H C H H C H H C O C H H H C O O C H H H C H C N H H C H C C C O O C H C H C C H H C C C O H H H H H H H H H H O
charge: -0.010799 0.183876 -0.275637 -0.012130 -0.033521 0.044602 -0.077283 -0.030476 -0.044654 -0.023986 0.219284 -0.340345 -0.284670 -0.136850 0.039833 0.199570 0.094844 -0.231399 -0.044326 0.180811 0.018713 0.015340 0.010357 0.013271 0.016895 0.011832 -0.025971 -0.007100 -0.015895 -0.016382 -0.042512 -0.041931 -0.037924 0.380809 0.093118 0.037168 0.026949 0.003197 0.086131 0.028106 0.028284 0.008771 0.206048 0.037796 -0.004124 0.073027 0.017521 0.016658 -0.034642 -0.180361 -0.025702 0.092123 0.044841 0.022071 0.220101 -0.407913 -0.241142 0.087241 0.040832 0.059540 0.037056 0.063432 0.019188 0.173833 -0.145664 0.021920 0.004277 -0.093003 0.151053 0.215802 0.023259 -0.023217 -0.275827 -0.290053 0.046223 0.019788 -0.029987 0.004438 -0.178150 0.101945 0.002184 -0.023091 0.084921 0.084766 0.089968 -0.173574 0.040565 0.011755 0.005828 0.006220 0.010011 0.039702 0.016022 0.008458 0.016886 0.189341 -0.288162
chargesum: -0.00000
title: Mulliken charges with hydrogens summed into heavy atoms:
elementType: Pd C O C C C C C C O O C C C C C C C C C C Na C C C C C O C C O O C C C N C C C C O O C C C C C C C O O
charge: -0.010799 0.183876 -0.275637 -0.056784 -0.077847 0.044602 -0.101268 -0.030476 0.219284 -0.340345 -0.284670 0.102553 0.094844 -0.231399 0.225222 0.013271 0.009795 -0.004551 -0.067901 -0.053819 -0.042512 0.380809 0.160432 0.151291 0.239720 0.107206 -0.034642 -0.180361 0.133334 0.220101 -0.407913 -0.241142 0.224668 0.082620 0.200029 0.005389 -0.093003 0.215802 0.043046 -0.018780 -0.275827 -0.290053 0.048407 -0.053078 -0.178150 0.101945 0.143070 0.140700 0.131335 0.015767 -0.288162
1716.lowfreq: -1186.0884 -16.2559 -5.4870 -0.0010 -0.0003 0.0009 3.0519 4.3906 11.0425
redmass: 1.1254 1.0275 5.2136 4.9487 5.1805 4.5492 4.6496 3.9764 1.1813 4.6758 3.2599 4.9258 4.0251 5.8917 4.0397 5.2927 5.4711 4.5518 3.7591 5.3813 3.8684 6.2708 3.2074 3.4562 4.0172 1.5728 3.9560 7.4710 3.8988 4.8866 5.2646 7.8146 8.9113 5.6458 4.8522 6.9739 5.6536 6.2357 5.1646 2.2684 2.2976 3.7792 4.8498 4.3812 3.8459 7.0346 2.8817 1.0970 3.1247 2.3344 1.2623 2.6415 3.3339 3.6397 4.4884 4.1686 2.6945 2.7716 3.4112 4.3095 3.5096 2.4650 4.1604 1.9970 1.3488 4.2712 1.3822 3.5188 3.8937 4.8149 3.9499 3.0888 2.9484 2.7409 4.5349 3.0357 3.3595 2.8842 5.4249 3.6854 3.8415 4.1952 3.3711 3.7784 1.3184 2.0978 3.1024 3.6926 4.8520 3.3175 3.1747 2.9895 4.4080 5.8627 6.3510 3.4584 5.7707 5.4343 3.8672 6.2615 4.0745 2.9998 4.1265 4.5455 4.0340 3.8610 4.8605 2.8528 6.9365 1.4036 3.7451 4.8633 1.5879 1.4146 1.5532 2.1620 2.3327 1.2671 2.5838 3.3925 2.9760 1.3453 2.4551 1.5095 1.6163 1.6748 1.8428 1.2050 2.4035 1.6403 1.3778 1.6876 1.3912 2.7949 1.6600 1.4367 1.6385 2.3376 1.5800 1.5211 1.9208 2.8502 1.4171 1.3648 1.4588 1.8830 1.9959 1.6321 1.6266 2.5966 2.3912 2.3787 2.1182 1.3273 4.2343 3.1069 1.8092 1.5386 1.5904 1.3189 1.2164 1.3027 1.1038 1.6001 1.1346 1.5901 1.5375 2.0895 1.8575 2.4445 2.1214 1.5056 2.0583 2.5244 1.5315 2.1248 2.1093 2.1874 1.5229 1.2556 1.7889 1.3258 1.4902 1.4334 1.8779 1.3269 4.1977 2.5920 2.0162 3.6533 1.8147 1.5492 1.6609 1.3172 5.8390 1.4996 1.3937 1.6981 1.3071 1.0646 1.0433 1.3300 1.7741 1.1630 1.0898 1.5006 1.4307 1.0435 1.0416 1.0742 1.0574 2.0292 1.1527 1.7997 1.2570 1.0787 1.1093 1.0758 1.7867 1.1510 2.0319 3.3453 1.0770 2.7133 3.7884 4.1157 3.2045 1.4676 3.7925 7.2023 7.1745 6.9458 7.7477 7.7327 7.2602 9.8144 7.4179 12.2180 11.3766 11.3703 1.0718 1.0410 1.0808 1.0384 1.0364 1.0381 1.0650 1.0363 1.0377 1.0384 1.0622 1.0378 1.0854 1.0982 1.1027 1.1028 1.1069 1.0936 1.1042 1.0990 1.1041 1.1043 1.1044 1.1040 1.1058 1.1050 1.1047 1.1041 1.0918 1.0999 1.0893 1.0913 1.1033 1.0902 1.1029 1.0913 1.0949 1.0930 1.0941 1.1090 1.0952 1.0918 1.0928 1.0785 1.0662
irintensity: 1354.7770 0.3647 0.0446 0.1801 0.0775 0.0928 0.4914 0.5702 0.4236 1.1269 0.0936 2.7730 0.6039 0.9259 0.6613 0.7788 2.2406 2.0295 1.6055 3.0112 2.2513 3.6840 2.2646 0.6228 1.8764 0.1978 1.6858 5.0333 0.6705 0.7375 0.2024 6.0718 4.9268 1.6799 0.1595 3.4588 0.0436 10.7520 1.2868 7.2092 0.8201 13.3368 7.1242 5.4755 1.5738 2.4330 9.7169 0.1206 11.3745 0.7834 0.8470 5.4365 6.0469 0.9046 5.5254 14.3311 0.0879 3.9203 4.7643 13.7368 17.3096 0.2398 6.8809 11.8903 92.9959 2.2490 7.2936 2.1171 7.7920 6.6620 9.7349 7.1954 0.3349 3.8718 44.2065 0.9307 14.3223 1.8284 7.6401 6.3693 7.5587 12.9683 3.3966 12.4776 52.6922 58.2594 20.3441 19.0077 6.4546 1.9335 13.6982 9.5098 17.6582 2.5185 1.5945 16.7654 4.7373 61.5831 4.2716 42.5550 15.2006 6.6753 18.6764 0.2043 4.4891 3.7146 13.8036 12.6121 12.3721 3.9862 8.5258 15.8313 2.9994 11.7047 11.8121 7.1134 9.5788 1.7474 9.6346 5.3041 57.3711 5.9438 4.7992 0.7938 1.9049 12.2056 4.3642 0.3091 7.8641 8.5078 0.4236 7.6012 1.8545 2.5524 1.1041 1.9169 3.3661 4.9446 1.3741 3.5775 0.4858 12.3496 0.1127 2.4849 3.1682 11.0655 4.4296 4.5450 2.5595 4.9325 3.2987 4.3409 9.6282 17.0882 73.6605 14.4939 2.1722 6.6166 1.3681 14.1254 116.1478 5.2409 25.6323 69.1662 14.6319 8.0214 7.8655 101.7293 136.0272 8.5624 215.4231 37.5422 1.1446 8.0974 18.4936 6.7414 44.3758 1.9255 26.8398 8.8404 135.4344 3.2488 11.6854 6.8822 4.7682 2.1653 14.5776 14.8567 0.3103 5.3254 24.1828 29.5925 21.8416 17.3685 21.7780 16.2258 0.5098 16.4540 65.2422 29.0520 0.3421 67.4656 300.7485 55.6793 11.5055 33.8947 1.6290 4.8354 7.1231 1.3375 10.5226 768.3118 59.6853 63.4611 16.4131 11.2425 14.5931 0.6485 19.0699 40.1344 20.9068 16.8093 5.9829 285.5756 39.8358 1137.9068 34.8625 110.9781 21.0516 1.4589 11.8030 10.0720 15.2828 77.7129 14.1881 340.9122 150.4706 313.1557 240.6191 165.1893 9.1580 15.4300 4.5554 34.7024 11.6322 28.1688 12.9706 7.7454 20.7958 20.2345 5.7733 1.1609 20.1740 14.4005 11.0902 8.9102 2.7471 5.7913 5.1526 21.9252 25.9477 20.9200 13.6426 10.5926 6.4688 18.8600 30.5486 7.6254 2.2645 3.9194 8.1597 17.4703 2.1656 13.5130 5.1254 15.8262 2.4909 0.3283 2.4734 2.2550 1.3652 7.2959 4.1082 91.7141 112.7677
temp: 333.150 k
press: 1.00000 atm
elementType: 46 6 8 6 6 6 6 6 1 1 6 8 8 6 1 1 6 6 1 6 1 1 1 6 6 6 6 1 6 1 6 1 1 11 6 1 1 1 6 1 1 1 6 1 1 6 1 1 6 8 6 1 1 1 6 8 8 6 1 1 1 6 1 6 7 1 1 6 1 6 6 6 8 8 6 1 6 1 6 6 1 1 6 6 6 8 1 1 1 1 1 1 1 1 1 1 8
symmnumber: 1
zpe: 2050172.5 jmol-1
zpe.correction: 0.780869 hartree
zpe.thermalcorrener: 0.845802 hartree
zpe.thermalcorrenthalpy: 0.846857 hartree
zpe.thermalcorrgfe: 0.672620 hartree
zpe.sumelectzpe: -2567.448226 hartree
zpe.sumelectthermal: -2567.383293 hartree
zpe.sumelectthermalent: -2567.382238 hartree
zpe.sumelectthermalfe: -2567.556475 hartree
dipole: 0.7820 5.0351 -1.4454
dipole: 5.2965
quadrupole: -299.8646 -296.8581 -305.7515
quadrupole: 4.3440 -1.8093 -2.1215
quadrupole: 0.9602 3.9666 -4.9268 4.3440 -1.8093 -2.1215
hfenergy: -2568.229095 hartree
pointgroup: C01 [X(C38H46N1Na1O10Pd1)]
dipole: 0.3076498 1.9809556 -0.5686491 debye
polarizability: 552.7715852|16.9501517|456.3476516|19.9297488|-31.1853922|437.9158282 unknown
InChI: InChI=1/C22H25O3.C14H18NO5.C2H3O2.Na.Pd/c1-5-19(23)12-9-17-14-16(3)8-13-20(17)22(4,21(24)25)18-10-6-15(2)7-11-18;1-14(2,3)20-13(19)15-11(12(17)18)8-9-4-6-10(16)7-5-9;1-2(3)4;;/h6-8,10-11,13-14H,5,9,12H2,1-4H3;4-7,11,15-16H,8H2,1-3H3;1H3;;/q-1;;-1;2*+1/rC38H46NNaO10Pd/c1-9-28(42)22-38-31-20-24(3)12-19-30(31)37(8,27-15-10-23(2)11-16-27)34-47-40-49(51(38,40,52-38,50(34)40)48-25(4)41)33(44)32(39-35(45)46-36(5,6)7)21-26-13-17-29(43)18-14-26/h10-20,32,38-39,43H,9,21-22H2,1-8H3
charge 0 multiplicity 1
97 atoms
Pd 0.23172612 -1.07503799 -0.07526696
C  -0.46226485 -3.71824318 -0.42945573
O  0.40902405 -3.85255809 0.45717631
C  3.9096188 -1.19837646 3.93722181
C  3.89983835 -0.13886815 3.02786073
C  2.91225063 -1.53290484 1.32445243
C  2.9369293 -2.58087246 2.25833819
C  3.42183601 -2.44872249 3.56372146
H  4.30282974 -1.04332112 4.94569233
H  2.5357027 -3.55138624 1.94669732
C  2.08734068 1.21412938 0.20616168
O  1.10079292 0.57221115 0.73699509
O  1.90219819 2.108196 -0.63574669
C  2.27426216 -1.92965121 0.00717605
H  2.51126345 -3.00372819 -0.11432412
H  1.13549754 -2.62833968 0.28446453
C  3.41065105 -0.26287873 1.72367933
C  3.48826337 0.93863696 0.77885387
H  4.29767895 0.81937693 3.36180442
C  3.82596142 2.26587883 1.49978175
H  4.83777408 2.22903506 1.92652581
H  3.79235714 3.07554078 0.75865104
H  3.09913577 2.49632195 2.29443839
C  4.58756973 0.7382207 -0.27924753
C  4.62799381 1.48393946 -1.46909615
C  5.62874033 -0.16951084 -0.04838728
C  5.63610053 1.27967421 -2.40860245
H  3.84319231 2.21453357 -1.6656447
C  6.64424284 -0.36024872 -0.98971015
H  5.64460157 -0.75578276 0.87270704
C  6.66261869 0.34795055 -2.19445082
H  5.62949364 1.86462811 -3.33348621
H  7.43767826 -1.08352403 -0.78061392
Na -0.38077516 2.01516396 -0.42702231
C  3.40166215 -3.61646586 4.5119294
H  2.36990647 -3.94253657 4.71428297
H  3.93518926 -4.48197059 4.09071616
H  3.87087621 -3.36068072 5.47207309
C  7.74245572 0.13544691 -3.22099722
H  7.32280099 -0.22204216 -4.17406836
H  8.27759079 1.07301317 -3.43674607
H  8.47984098 -0.60400907 -2.87937946
C  2.68562368 -1.37646155 -1.35857272
H  3.77187798 -1.52073556 -1.51811173
H  2.51280239 -0.30293334 -1.50846372
C  1.61254315 -1.34554662 -3.694624
H  2.49909044 -0.77526255 -4.02226711
H  1.33444387 -2.0550138 -4.4863221
C  1.99047181 -2.14696369 -2.47087597
O  1.75599237 -3.33355749 -2.3656305
C  0.45966134 -0.38113771 -3.3942705
H  -0.4187295 -0.92098256 -3.01042969
H  0.75477875 0.36682889 -2.63744254
H  0.1680758 0.16500047 -4.30267788
C  -2.5148023 -0.30198744 0.27352198
O  -1.43977191 0.06241622 -0.36294948
O  -2.61832968 -1.2531542 1.02850772
C  -1.17804476 -4.90648178 -0.99698591
H  -2.18746404 -4.63044095 -1.32189401
H  -0.60177602 -5.23295795 -1.87602883
H  -1.20267932 -5.72244454 -0.26653444
C  -3.70613575 0.63638097 0.06962673
H  -3.59351356 1.19097611 -0.87556503
C  -3.78095388 1.64481584 1.24074931
N  -4.90051044 -0.16679859 0.00975697
H  -4.65137381 2.28896805 1.04486478
H  -3.98047198 1.0573082 2.15069841
C  -2.53507539 2.46772329 1.42765179
H  -4.87364328 -1.08032292 0.45895592
C  -6.06413572 0.35414666 -0.45981498
C  -1.49720605 2.01218388 2.26064738
C  -2.33872178 3.67702263 0.74479928
O  -6.16127485 1.48288981 -0.91057399
O  -7.06019613 -0.53782944 -0.36105163
C  -0.31337764 2.72797797 2.41205372
H  -1.61288535 1.05547479 2.77866439
C  -1.14621037 4.40366074 0.87970436
H  -3.13209172 4.06421417 0.09852538
C  -8.40056474 -0.22711319 -0.80986069
C  -0.12411429 3.93168369 1.71789693
H  0.49476541 2.34936565 3.04033998
H  -1.01532961 5.34981746 0.34534756
C  -8.4009189 0.05634726 -2.30857225
C  -8.96731608 0.94150169 -0.00992575
C  -9.17499726 -1.50329055 -0.50886014
O  1.05312634 4.57417212 1.87753319
H  -7.84115696 0.97290009 -2.53153503
H  -7.94526048 -0.78576047 -2.85104572
H  -9.43694403 0.17321932 -2.66006621
H  -10.02598486 1.08650684 -0.27206236
H  -8.90556575 0.72545563 1.06746723
H  -8.41541061 1.86473687 -0.22441317
H  -9.13882115 -1.72612693 0.56731519
H  -10.22575499 -1.38937571 -0.81214349
H  -8.73810134 -2.35156865 -1.05524633
H  1.09338077 5.36425464 1.3213464
O  -0.74042451 -2.57767929 -0.93543871
