program: Gaussian 16
title: freeze mn15/BS1
version: ES64L-G16RevC.01
method: RMN15
basis: GenECP
operation: Freq
keyword: #N
keyword: Geom=AllCheck
keyword: Guess=TCheck
keyword: SCRF=Check
keyword: GenChk
keyword: RMN15/GenECP
keyword: Freq
converged: YES YES NO YES
title: Mulliken charges:
elementType: Pd C O C C C C C H H C O O C H H C C H C H H H C C C C H C H C H H Na C H H H C H H H C H H C H H C O C H H H C O O C H H H C H C N H H C H C C C O O C H C H C C H H C C C O H H H H H H H H H H O
charge: -0.012206 0.183787 -0.275926 -0.012475 -0.030837 0.043370 -0.075695 -0.030829 -0.043619 -0.022258 0.197790 -0.331929 -0.278184 -0.136894 0.040034 0.198911 0.091856 -0.215173 -0.048350 0.142988 0.030018 0.030221 -0.006962 0.020626 0.010114 0.011710 -0.024189 -0.001742 -0.015899 -0.015033 -0.042401 -0.039237 -0.037039 0.388366 0.092813 0.039005 0.027373 0.004135 0.085673 0.009356 0.028734 0.029942 0.202121 0.038812 -0.002594 0.072833 0.019636 0.017721 -0.036395 -0.179834 -0.028245 0.092766 0.045243 0.024293 0.222937 -0.406789 -0.241774 0.087031 0.059725 0.037546 0.041348 0.064433 0.019469 0.174954 -0.146717 0.022713 0.003033 -0.092373 0.151134 0.215607 0.018547 -0.012149 -0.275343 -0.290250 0.020614 0.017453 -0.006912 0.005969 -0.178202 0.094711 -0.018106 0.001515 0.084813 0.084798 0.090032 -0.176205 0.005879 0.040995 0.011484 0.006232 0.009888 0.040144 0.015873 0.008470 0.016624 0.182946 -0.288399
chargesum: -0.00000
title: Mulliken charges with hydrogens summed into heavy atoms:
elementType: Pd C O C C C C C C O O C C C C C C C C C C Na C C C C C O C C O O C C C N C C C C O O C C C C C C C O O
charge: -0.012206 0.183787 -0.275926 -0.056094 -0.079187 0.043370 -0.097953 -0.030829 0.197790 -0.331929 -0.278184 0.102051 0.091856 -0.215173 0.196266 0.020626 0.008372 -0.003323 -0.063426 -0.052938 -0.042401 0.388366 0.163326 0.153705 0.238339 0.110190 -0.036395 -0.179834 0.134058 0.222937 -0.406789 -0.241774 0.225650 0.083902 0.200700 0.004417 -0.092373 0.215607 0.035999 -0.006180 -0.275343 -0.290250 0.002508 -0.005397 -0.178202 0.094711 0.143172 0.141062 0.130998 0.006742 -0.288399
chargesum: 0.00000
1716.lowfreq: -1181.0812 -0.0012 -0.0009 -0.0005 0.3729 3.6629 6.2577 10.9246 16.4419
redmass: 1.1262 5.3105 4.7983 4.7934 1.0335 5.7031 4.4112 3.4993 1.1911 4.8819 3.2734 4.6329 4.1460 4.5629 5.2027 5.6004 5.6777 4.2524 4.3805 3.4195 5.1292 5.2881 2.9449 3.4708 3.7372 1.7193 4.0452 5.9817 3.9595 4.6836 6.0908 7.7749 8.1664 5.7334 5.1025 7.0633 5.7591 6.3661 4.7835 7.6193 1.9140 2.0812 5.0629 4.3728 4.5929 4.9034 2.5514 1.0987 2.5703 2.5775 1.3151 3.1862 3.0241 3.6217 4.5833 4.1284 2.8976 2.7286 3.2054 4.5821 1.9749 2.0841 2.1511 4.2308 2.4951 4.1186 1.7912 3.5130 2.0678 4.9532 4.1004 3.0970 2.9245 2.7414 3.9578 3.3967 3.3636 2.8832 5.2207 3.7048 3.8285 4.2141 3.3578 3.6809 1.5933 1.6594 3.0395 3.7462 4.8487 3.3436 3.1325 3.0585 4.4219 5.6879 6.3254 3.5350 5.8248 5.4455 3.8456 6.2472 4.0700 2.9947 4.0834 4.5088 4.0605 4.5087 3.2122 2.6048 6.7965 1.6513 3.8732 4.7431 1.5723 1.4003 1.5650 2.4357 1.9962 1.2663 2.9851 2.9100 3.1631 1.3922 2.4723 1.5091 2.1374 1.6133 1.4613 1.2051 2.4252 1.6349 1.6491 1.3994 1.3897 2.9604 1.6208 1.4035 1.6652 1.6135 2.0132 1.5195 2.0876 2.9061 1.4170 1.3647 1.4591 1.8797 1.9916 1.6369 1.6310 2.7343 2.4225 2.3290 2.0171 1.3085 4.2777 3.1252 2.0823 1.4136 1.5856 1.3247 1.2985 1.1423 1.1811 1.6145 1.6331 1.1087 1.5309 2.0907 1.8634 2.4652 2.2857 1.4150 2.0562 2.3193 1.6077 2.1273 2.1082 2.1651 1.5521 1.2533 1.6864 1.3289 1.4972 1.4883 1.8748 1.3248 4.2192 1.3115 6.2417 4.0914 1.9700 1.5476 2.6291 2.3366 1.3075 1.5680 1.3932 1.6459 1.3071 1.0616 1.0433 1.2491 1.4836 1.5529 1.1143 1.3936 1.5573 1.0514 1.0414 1.0746 1.0508 1.2561 2.1104 1.1213 1.1735 1.1725 1.3169 1.0756 1.8094 1.1402 2.0932 3.2785 1.0769 2.8452 3.7856 4.1555 3.1848 1.4666 3.5378 7.1894 7.1737 6.9664 7.4014 7.5633 7.2046 10.8528 7.4685 12.1831 11.4137 11.3709 1.0717 1.0398 1.0410 1.0808 1.0384 1.0381 1.0363 1.0648 1.0377 1.0385 1.0620 1.0378 1.0855 1.0981 1.1027 1.0985 1.1027 1.1071 1.0922 1.1043 1.1006 1.1041 1.1045 1.1041 1.1050 1.1059 1.1047 1.1051 1.0918 1.0998 1.0915 1.1032 1.1028 1.0903 1.0896 1.0911 1.0911 1.0969 1.1090 1.0939 1.0949 1.0919 1.0929 1.0785 1.0661
irintensity: 1359.2028 0.1176 0.4072 0.0513 0.3201 0.5905 0.2329 0.1656 0.4751 1.0457 0.1466 2.4774 0.4980 0.2338 1.8016 1.0529 3.3520 0.5070 10.2397 1.0277 5.6497 2.0574 0.3686 0.7069 2.7205 0.8682 1.1399 2.0342 1.1276 1.1280 0.0923 5.8843 4.5776 1.8793 0.2258 3.6042 0.1551 12.4108 1.3570 6.3181 8.7005 10.0290 6.6726 5.8119 1.4611 1.4459 9.3743 0.1150 15.0509 1.1356 2.0360 5.5621 8.8365 1.5807 8.8555 6.3978 0.1459 3.1439 6.9736 15.3042 81.8613 16.3541 36.1301 4.8059 10.3939 4.0179 3.7157 7.3136 8.9547 9.1590 10.6091 7.5929 0.2478 5.1342 22.9586 20.5417 15.1551 1.8322 8.3360 8.5907 7.1697 11.0651 4.0138 10.7029 31.1907 83.8307 20.1820 17.1984 5.2868 2.0594 13.7700 9.1811 17.6877 3.4724 0.8508 16.9670 4.5740 66.8498 4.0697 42.0440 14.7154 7.3782 16.4250 0.0604 4.7686 10.8696 10.3394 7.7560 12.7243 3.8906 9.1877 16.7599 1.1299 12.6025 11.5346 1.9407 15.3657 2.3647 12.1628 0.9505 59.4032 6.3428 5.5309 0.8081 17.3879 1.4977 0.5898 0.3159 7.6311 9.6872 6.8047 0.3284 1.7601 2.5754 1.2290 2.1680 3.1135 0.1242 1.7827 3.6284 0.3493 13.7874 0.0995 2.3584 3.5123 10.6272 4.3060 4.8561 2.6186 4.9844 5.5542 10.5769 6.5827 16.5248 77.8773 13.3280 2.4172 6.0772 1.1679 28.1894 4.1046 57.2389 63.8803 63.7113 10.1182 18.0411 7.4657 103.2342 140.8395 6.6207 242.3361 5.8651 0.9991 11.4184 15.6684 6.7756 43.2999 2.4401 48.2882 11.7536 40.8433 5.0589 14.2097 58.7589 4.5267 2.0669 23.1494 7.0865 5.8976 5.5748 23.0968 29.6919 24.9556 13.5804 14.1284 23.1802 0.3372 13.0223 63.9634 28.3474 0.3550 34.2190 186.5857 265.9614 19.5884 20.4061 105.7490 3.2635 7.5384 0.5983 1.8467 62.4425 622.7668 8.8006 17.5008 24.9048 36.9048 0.6404 17.7736 43.0666 16.2920 11.4782 6.0470 289.3716 63.8094 1134.3456 26.7346 106.5179 15.0408 1.4485 10.3549 6.1327 0.6541 61.2437 7.4161 400.0856 132.7518 301.9568 246.2950 164.0349 9.4095 40.3382 15.7591 4.7439 31.1383 26.8005 7.9282 12.2856 20.6258 20.1232 6.1143 1.0720 19.0334 14.2932 10.4474 28.6349 9.0590 2.7892 3.6575 6.9990 20.7600 25.9934 13.2376 10.6146 18.9249 6.1644 30.7225 7.3472 2.0629 3.8366 16.3182 1.6716 5.8726 12.8882 7.3403 14.8675 1.0380 1.3544 2.0575 2.2888 0.8918 9.3530 4.1677 92.7821 119.8011
temp: 333.150 k
press: 1.00000 atm
elementType: 46 6 8 6 6 6 6 6 1 1 6 8 8 6 1 1 6 6 1 6 1 1 1 6 6 6 6 1 6 1 6 1 1 11 6 1 1 1 6 1 1 1 6 1 1 6 1 1 6 8 6 1 1 1 6 8 8 6 1 1 1 6 1 6 7 1 1 6 1 6 6 6 8 8 6 1 6 1 6 6 1 1 6 6 6 8 1 1 1 1 1 1 1 1 1 1 8
symmnumber: 1
zpe: 2049947.2 jmol-1
zpe.correction: 0.780784 hartree
zpe.thermalcorrener: 0.846795 hartree
zpe.thermalcorrenthalpy: 0.847850 hartree
zpe.thermalcorrgfe: 0.669369 hartree
zpe.sumelectzpe: -2567.449574 hartree
zpe.sumelectthermal: -2567.383563 hartree
zpe.sumelectthermalent: -2567.382508 hartree
zpe.sumelectthermalfe: -2567.560989 hartree
dipole: 1.8955 2.9074 -0.4367
dipole: 3.4981
quadrupole: -294.5420 -315.5880 -300.4432
quadrupole: 5.5124 1.5340 0.3474
quadrupole: 8.9824 -12.0636 3.0812 5.5124 1.5340 0.3474
hfenergy: -2568.2303581 hartree
pointgroup: C01 [X(C38H46N1Na1O10Pd1)]
dipole: 0.7457492 1.1438735 -0.1718226 debye
polarizability: 557.9227552|15.9654206|458.4185626|17.8701761|-33.4720335|432.9721581 unknown
InChI: InChI=1/C22H25O3.C14H18NO5.C2H3O2.Na.Pd/c1-5-19(23)12-9-17-14-16(3)8-13-20(17)22(4,21(24)25)18-10-6-15(2)7-11-18;1-14(2,3)20-13(19)15-11(12(17)18)8-9-4-6-10(16)7-5-9;1-2(3)4;;/h6-8,10-11,13-14H,5,9,12H2,1-4H3;4-7,11,15-16H,8H2,1-3H3;1H3;;/q-1;;-1;2*+1/rC38H46NNaO10Pd/c1-9-28(42)22-38-31-20-24(3)12-19-30(31)37(8,27-15-10-23(2)11-16-27)34-47-40-49(51(38,52-38,50(34)40)48-25(4)41)33(44)32(39-35(45)46-36(5,6)7)21-26-13-17-29(43)18-14-26/h10-20,32,38-39,43H,9,21-22H2,1-8H3
charge 0 multiplicity 1
97 atoms
Pd 0.19676461 -1.03769038 -0.09016846
C  -0.5223316 -3.65943361 -0.53648505
O  0.34392366 -3.83215334 0.34836892
C  3.90493579 -1.36638909 3.91627228
C  3.8993639 -0.27079753 3.05120818
C  2.87338592 -1.57963801 1.3033779
C  2.89135473 -2.66448952 2.19460615
C  3.39065975 -2.59229223 3.49910713
H  4.31512128 -1.25924244 4.92414156
H  2.4744013 -3.61603846 1.84729768
C  2.07319884 1.20020015 0.27567044
O  1.07844735 0.56431277 0.7943348
O  1.90846421 2.10695616 -0.55563207
C  2.2316128 -1.9169178 -0.02821368
H  2.45640459 -2.98840177 -0.18913566
H  1.08486137 -2.61045381 0.21943159
C  3.38936727 -0.33323437 1.75030683
C  3.46865386 0.90600352 0.85684184
H  4.32088207 0.66489724 3.41906498
C  3.77746146 2.20306782 1.64342491
H  4.79134129 2.17879991 2.06527258
H  3.71508151 3.05084868 0.94622905
H  3.05538096 2.34617165 2.46609536
C  4.58584221 0.76583896 -0.19293011
C  4.66389897 1.60642758 -1.31611464
C  5.60735181 -0.17623692 -0.01670394
C  5.69256905 1.46673107 -2.24509909
H  3.89464184 2.36264395 -1.47141821
C  6.64182855 -0.30380425 -0.94793231
H  5.59406117 -0.83795876 0.85167845
C  6.70080559 0.50481419 -2.0863387
H  5.71617052 2.12761015 -3.11690817
H  7.418879 -1.05570243 -0.78321254
Na -0.37826078 2.06555777 -0.43515569
C  3.35784982 -3.79511277 4.40179913
H  2.32141169 -4.08404578 4.63481705
H  3.83446212 -4.66504032 3.92557445
H  3.87547939 -3.59796739 5.35080253
C  7.80421228 0.36494665 -3.10002468
H  8.51215735 -0.42556736 -2.81531043
H  7.40315332 0.11745778 -4.09497326
H  8.36930881 1.30383288 -3.20556631
C  2.66145085 -1.32029828 -1.37054634
H  3.74641558 -1.47682594 -1.52592516
H  2.50715257 -0.239416 -1.48544581
C  1.59316928 -1.19955169 -3.70895909
H  2.48577317 -0.62942043 -4.01945125
H  1.30682729 -1.88027887 -4.52258918
C  1.96184733 -2.04434005 -2.5120262
O  1.71612711 -3.23147996 -2.44697792
C  0.45146784 -0.23197289 -3.37807658
H  -0.43492501 -0.77383614 -3.01610706
H  0.75531575 0.4843778 -2.59451917
H  0.17016495 0.34991696 -4.26726424
C  -2.52351681 -0.24921732 0.30657249
O  -1.46184261 0.12327022 -0.34829744
O  -2.60566278 -1.21081131 1.0512602
C  -1.24957121 -4.82050938 -1.14414497
H  -0.67368739 -5.12620401 -2.03086881
H  -1.28669492 -5.65864841 -0.43979133
H  -2.25436388 -4.52263364 -1.46404502
C  -3.72324215 0.68457408 0.13769788
H  -3.64220206 1.23668883 -0.81219549
C  -3.76647776 1.69765877 1.30649588
N  -4.914942 -0.12456144 0.11781725
H  -4.65903688 2.3209449 1.14552661
H  -3.91169705 1.11314619 2.22858436
C  -2.53350104 2.55141285 1.42691283
H  -4.86841541 -1.03845558 0.56457916
C  -6.09440357 0.38750634 -0.3209041
C  -1.45727788 2.14626416 2.23008524
C  -2.39024661 3.74571378 0.69850434
O  -6.21142445 1.51440521 -0.77132614
O  -7.08135299 -0.51095156 -0.19265728
C  -0.28160379 2.89436026 2.30487202
H  -1.5268772 1.20586386 2.78469822
C  -1.21425887 4.50057023 0.75717555
H  -3.21872434 4.09137147 0.07291272
C  -8.43510994 -0.21100358 -0.60743564
C  -0.14369004 4.07396457 1.56100115
H  0.55001216 2.53719468 2.91919862
H  -1.10475722 5.4283173 0.19204872
C  -8.47603555 0.06800691 -2.10642133
C  -8.98930819 0.95604339 0.20347598
C  -9.19235299 -1.49170487 -0.28285019
O  0.98675719 4.8114326 1.5655063
H  -9.5215063 0.17725213 -2.43138996
H  -7.92809 0.98749829 -2.34616322
H  -8.02908468 -0.77275851 -2.65816775
H  -10.05548286 1.0925386 -0.03139322
H  -8.89788721 0.74396078 1.27954563
H  -8.45000023 1.88255961 -0.0281829
H  -9.12689052 -1.71090581 0.79269685
H  -10.25136721 -1.38620738 -0.55927292
H  -8.76360438 -2.33857509 -0.83782548
H  1.68676222 4.35446428 2.05428851
O  -0.78568797 -2.49979646 -1.00644513
