program: Gaussian 16
title: MN15/BS1
version: ES64L-G16RevC.01
method: RMN15
basis: GenECP
operation: Freq
keyword: #N
keyword: Geom=AllCheck
keyword: Guess=TCheck
keyword: SCRF=Check
keyword: GenChk
keyword: RMN15/GenECP
keyword: Freq
converged: YES YES YES YES
title: Mulliken charges:
elementType: Pd C O C C C C C H H C O O C H H C C H C H H H C C C C H C H C H H Na C H H H C H H H C H H C H H C O C H H H O C C C C H H H H H H H H H N C C H C O O H H C C C C H C H C H H O H
charge: -0.474994 0.223151 -0.255042 0.004754 0.076731 0.181362 -0.061985 -0.091911 -0.013228 -0.006631 0.193678 -0.320105 -0.313510 0.006015 0.039601 0.200892 0.027066 -0.244115 -0.016687 0.194104 -0.001505 0.018033 0.030686 -0.023876 0.012794 0.026858 -0.011509 -0.001020 -0.018267 -0.013940 -0.056379 -0.033643 -0.026686 0.516497 0.211864 0.040972 -0.008538 0.024132 0.091091 0.019957 0.021959 0.019251 0.193125 0.031094 0.016944 0.011139 0.030309 0.014367 -0.076653 -0.181833 0.046395 0.013042 0.004380 0.029176 -0.295164 -0.182484 0.105491 0.085849 0.099105 0.041649 -0.005344 0.005433 0.005970 0.012316 0.044881 -0.003091 0.019693 0.011149 -0.137436 0.026791 0.120885 0.041340 0.181627 -0.331043 -0.320762 0.019598 0.027168 -0.076196 0.020187 0.019500 -0.007577 -0.017119 0.048117 0.008127 0.153297 -0.045333 0.000478 -0.186753 0.190293
chargesum: -0.00000
title: Mulliken charges with hydrogens summed into heavy atoms:
elementType: Pd C O C C C C C C O O C C C C C C C C C C Na C C C C C O C O C C C C N C C C O O C C C C C C O
charge: -0.474994 0.223151 -0.255042 -0.008474 0.060044 0.181362 -0.068616 -0.091911 0.193678 -0.320105 -0.313510 0.045616 0.027066 -0.244115 0.241318 -0.023876 0.011773 0.012918 -0.045152 -0.044953 -0.056379 0.516497 0.268430 0.152258 0.241163 0.055815 -0.076653 -0.181833 0.092993 -0.295164 -0.182484 0.147228 0.149015 0.126855 0.063456 0.068132 0.120885 0.228393 -0.331043 -0.320762 -0.076196 0.003069 0.027626 -0.052910 0.048595 0.153297 0.003540
chargesum: -0.00001
1716.lowfreq: -326.2233 -0.0013 -0.0007 -0.0003 2.6092 5.0800 7.8323 14.0194 27.4986
frequency: -326.2233 13.9578 27.4972 31.8664 34.2465 39.3886 43.3993 46.2942 53.7807 56.4147 64.5679 66.0534 68.2247 74.5368 82.9602 89.0621 90.8863 97.6958 101.4182 103.8072 110.9676 115.4819 119.8116 130.0925 132.5243 138.0481 149.0736 159.2909 161.6956 170.0926 176.7780 191.7397 201.0003 207.3960 212.8701 217.1029 221.6086 225.9811 233.8442 238.7952 242.6985 245.2710 251.7904 256.8847 274.8445 277.6055 285.5959 286.7807 312.4870 318.1585 321.0700 331.6070 342.4549 344.8843 349.9855 359.3066 365.9777 371.3777 378.0903 378.2617 390.7122 402.3180 407.3824 416.5409 421.7151 424.7110 427.6010 432.9433 438.5760 446.1961 453.6012 455.0986 459.1291 498.6673 506.9766 515.4554 520.6607 567.5650 573.6968 576.2787 585.8124 618.4653 623.0970 627.7282 630.5887 634.2146 647.5641 660.5082 704.9362 713.2727 720.5055 735.8063 743.6233 751.0087 756.3921 774.6855 785.6854 786.8557 794.0000 815.8357 825.5253 827.6667 840.6629 849.4413 850.2880 855.0129 868.9009 873.2122 878.5188 885.7309 901.3024 902.9987 916.4512 919.3536 920.0810 922.9692 935.1742 936.9572 946.5652 947.2803 958.7400 970.9693 982.7922 987.0513 987.8663 990.8672 1002.1881 1002.5718 1013.8013 1017.1241 1021.2408 1021.7820 1027.1014 1029.3433 1037.9950 1041.9946 1047.1920 1061.3098 1079.7001 1087.7800 1094.8792 1103.7137 1109.4381 1120.7145 1122.1156 1141.5221 1147.3916 1153.0242 1159.9620 1174.3216 1178.2459 1206.9199 1210.2402 1216.5933 1221.8367 1227.4922 1237.1573 1241.0319 1250.7630 1260.9549 1262.0096 1267.4795 1274.0187 1282.1256 1290.4002 1300.3721 1302.8132 1313.7000 1318.5490 1329.3231 1349.4668 1350.6537 1353.0156 1362.9292 1363.7463 1365.6997 1368.5359 1372.3253 1377.9507 1378.3187 1379.7312 1392.9226 1393.9822 1405.4792 1408.0621 1413.3785 1420.6132 1422.9457 1426.9721 1430.7731 1432.2583 1432.5826 1434.0903 1435.9602 1437.2637 1440.2944 1443.5899 1447.6126 1449.8890 1450.1746 1450.8286 1456.6565 1468.2687 1471.2073 1503.6193 1534.4699 1550.5255 1550.8155 1564.1150 1583.1484 1633.6373 1650.6813 1660.7720 1679.7646 1697.4406 1708.4671 1734.1608 1842.5842 1861.1137 3062.7911 3066.3375 3067.7036 3072.5487 3076.3664 3077.9013 3080.8981 3086.1900 3089.4819 3111.3919 3113.5165 3117.7258 3147.2328 3153.2697 3160.3404 3163.9481 3172.0671 3176.8573 3178.3705 3179.4866 3183.3634 3183.8735 3191.6278 3192.1263 3194.0890 3201.6621 3204.2471 3204.7599 3206.9901 3209.0011 3209.3560 3210.2844 3211.4725 3211.7219 3212.8274 3223.5120 3231.6652 3234.0430 3235.6904 3273.0633 3575.0893 3884.5501
redmass: 4.5142 5.3764 4.0717 4.8005 4.5588 2.4676 4.4986 6.4661 4.0290 5.7926 5.6685 4.7411 3.0289 5.1701 8.0603 4.3250 3.7455 4.0025 5.6428 5.8349 9.4015 6.3611 6.3607 3.5149 2.5840 3.8340 4.8840 5.1536 5.9269 5.8756 3.4177 7.5016 5.8814 4.9613 4.0786 1.5641 1.4902 2.2184 2.1476 3.0745 3.1945 1.9775 1.2366 2.7885 3.1568 4.9097 1.1535 4.5180 4.8303 3.8398 3.1227 4.5923 3.3144 6.0378 2.4741 2.9682 5.0453 3.3615 3.2346 2.8232 1.7592 1.1873 2.5814 2.8140 2.7676 2.5414 2.7320 5.3593 3.3812 3.2495 2.8477 2.2223 3.0189 3.8240 4.1452 4.8272 4.0179 3.4002 3.9501 3.2947 3.4100 1.4723 3.2307 5.1598 3.2641 6.5306 3.4839 4.2704 2.3338 4.9806 3.6090 3.9589 4.0091 1.9980 3.0675 7.1480 3.6060 3.5521 7.2349 3.2576 3.0224 1.9703 1.4708 1.6192 4.5820 1.6562 2.2932 1.3457 2.3605 1.9857 2.6432 2.3370 1.3879 1.5077 2.2646 1.8443 1.2180 2.3580 1.4487 3.1369 1.3353 1.4112 1.3801 1.3874 1.3806 1.5414 1.9807 1.7879 2.1453 2.6773 1.4029 1.4185 1.4553 1.6425 1.8820 1.6541 2.1383 1.9506 2.2564 1.2704 3.3200 2.0524 1.8800 1.3787 1.9340 1.7561 1.1818 1.2061 1.2702 1.2622 1.0967 1.4378 1.5310 1.9389 1.8213 3.5068 2.5246 2.2489 1.4118 2.0470 1.8063 2.0282 2.0714 1.6822 2.0791 1.3650 1.4242 3.4015 1.4581 1.8788 2.0728 1.7262 6.5747 1.5130 1.5350 1.3742 1.5574 1.3582 1.3814 1.3082 1.2977 4.0979 4.2806 1.6223 1.0706 1.2327 1.5109 1.3347 1.0839 1.2426 1.0677 1.0683 1.0601 1.0599 1.0576 1.1320 1.3210 1.4706 1.1092 1.1664 2.6885 1.9335 2.0063 1.8476 4.0847 4.0699 3.2509 3.8245 6.1303 5.0029 6.9540 7.3446 7.0908 7.0995 7.1326 12.0951 11.7443 11.4569 11.7696 1.0427 1.0386 1.0643 1.0382 1.0365 1.0381 1.0383 1.0373 1.0843 1.0737 1.0651 1.0987 1.0973 1.1026 1.0876 1.1033 1.1043 1.1043 1.1050 1.1038 1.1044 1.1050 1.1041 1.1022 1.1036 1.0909 1.0909 1.0921 1.1030 1.0886 1.1018 1.0899 1.1035 1.0909 1.0898 1.0967 1.0949 1.0941 1.0947 1.0912 1.0776 1.0660
irintensity: 470.0073 0.1038 0.1595 0.6410 1.4761 0.6584 0.6784 0.9729 0.7858 0.8289 1.9873 1.1571 1.8219 1.2952 1.0656 1.4518 2.3298 1.2989 1.8147 0.4756 1.9628 3.1500 4.3628 4.8574 5.7433 4.4623 8.9338 1.7583 11.1858 4.8923 2.5227 7.6265 5.8701 4.3447 1.5481 1.6443 2.6830 3.9256 8.0006 23.7050 0.7864 1.1286 3.6743 0.7493 3.8599 32.7793 0.5233 2.0847 3.1776 7.7485 7.7846 28.8433 0.3536 2.5480 1.8805 7.6614 8.7553 27.5335 7.9006 19.0326 2.3274 117.4844 13.8250 3.0999 0.5077 7.1186 0.4722 9.0939 1.7416 9.0497 2.0269 1.4300 4.1268 13.7694 15.4475 1.1677 3.5431 32.8405 29.3820 15.2971 13.8144 110.1547 30.9429 5.9563 20.7270 0.2285 17.7909 44.3699 6.0703 4.8554 0.4024 1.3846 15.0955 2.6272 3.9730 9.7262 9.1624 12.6169 20.6279 2.2836 14.3104 27.7758 4.0903 15.1344 4.5040 0.8379 24.1500 1.6586 15.6520 6.9286 9.8500 9.7580 19.4204 0.9175 6.1674 3.5005 0.5802 11.9404 18.3597 3.8394 12.6067 2.7225 0.0770 1.5270 2.6533 0.7042 3.5313 9.4535 1.8507 12.8151 1.6888 0.1899 5.8432 35.2153 9.6488 3.4616 16.2661 1.0113 6.8583 13.8680 45.5914 11.4224 8.1344 11.5699 43.2747 1.1163 53.8257 66.9102 28.3218 0.4301 13.4496 52.1171 7.9730 48.2231 37.7363 45.9953 228.0574 22.6177 3.7604 12.1721 21.9109 36.2641 5.5287 47.8130 7.0674 17.8814 12.7923 39.6024 57.2762 33.0239 3.3164 32.4593 0.4826 37.8631 28.5209 23.1697 30.8862 5.8200 2.3942 63.8502 44.9438 116.6261 144.8641 21.0321 2.2466 7.2311 18.9169 1.1442 1.5658 13.1714 6.1613 2.0797 0.7286 1.6334 13.3614 21.6210 1.5053 5.8469 0.2507 11.4213 14.6772 11.8794 107.4196 151.2006 47.2611 495.2476 36.2110 130.4733 371.1595 3.1077 279.9020 15.5884 49.6586 39.8564 3.9441 387.8957 600.9479 366.5950 85.6774 26.6251 17.2632 12.5915 14.5047 12.7452 11.2609 18.6881 22.2850 20.8387 10.2630 14.6040 6.6163 17.5289 6.3348 8.1255 27.7719 13.5840 22.5798 14.8262 19.7295 33.6195 9.0929 10.5758 2.1583 1.1497 13.4199 0.5630 4.0572 2.5906 12.6007 7.0275 10.1800 2.5073 13.2448 0.2115 8.2604 1.4082 2.2664 1.1953 1.1034 112.6210 110.8536
temp: 333.150 k
press: 1.00000 atm
elementType: 46 6 8 6 6 6 6 6 1 1 6 8 8 6 1 1 6 6 1 6 1 1 1 6 6 6 6 1 6 1 6 1 1 11 6 1 1 1 6 1 1 1 6 1 1 6 1 1 6 8 6 1 1 1 8 6 6 6 6 1 1 1 1 1 1 1 1 1 7 6 6 1 6 8 8 1 1 6 6 6 6 1 6 1 6 1 1 8 1
symmnumber: 1
zpe: 1889605.3 jmol-1
zpe.correction: 0.719713 hartree
zpe.thermalcorrener: 0.778807 hartree
zpe.thermalcorrenthalpy: 0.779862 hartree
zpe.thermalcorrgfe: 0.621955 hartree
zpe.sumelectzpe: -2338.837201 hartree
zpe.sumelectthermal: -2338.778107 hartree
zpe.sumelectthermalent: -2338.777052 hartree
zpe.sumelectthermalfe: -2338.934958 hartree
dipole: 1.3457 -1.3104 4.8619
dipole: 5.2121
quadrupole: -270.2152 -284.0697 -289.6799
quadrupole: 13.8767 -7.2981 5.3879
quadrupole: 11.1064 -2.7481 -8.3583 13.8767 -7.2981 5.3879
hfenergy: -2339.5569134 hartree
pointgroup: C01 [X(C36H42N1Na1O8Pd1)]
dipole: 0.5294239 -0.5155535 1.9128256 debye
polarizability: 634.6229744|-7.036369|372.5196774|21.3548763|-24.5399752|407.0424484 unknown
InChI: InChI=1/C22H24O3.C14H18NO5.Na.Pd/c1-5-19(23)12-9-17-14-16(3)8-13-20(17)22(4,21(24)25)18-10-6-15(2)7-11-18;1-14(2,3)20-13(19)15-11(12(17)18)8-9-4-6-10(16)7-5-9;;/h6-11,13-14H,5,12H2,1-4H3;4-7,11,15-16H,8H2,1-3H3;;/q2*-2;+4;/rC36H42NNaO8Pd/c1-8-23(39)15-16-25-26-19-29-34(7)30(25)47(29,34)27-18-24(40)14-11-21(27)17-28(37-31(41)42-32(3,4)5)35-38(43-35,44-35)36(45-38,46-38)33(26,6)22-12-9-20(2)10-13-22/h9-14,16,18-19,27-30,37,40H,8,15,17H2,1-7H3
charge 0 multiplicity 1
89 atoms
Pd -1.11447144 0.09699678 0.3498429
C  -4.23146649 -0.77498488 -1.5024758
O  -5.34041666 -0.27753144 -1.57846627
C  -0.59616367 -2.06208282 0.28753074
C  0.65162332 -2.00985963 -0.42213714
C  1.56514611 -0.57675764 1.28517967
C  0.31743996 -0.67500577 1.9850206
C  -0.71818072 -1.56799812 1.61535213
H  -1.40764776 -2.67720766 -0.11556653
H  0.21368519 -0.13783582 2.93415862
C  2.80492991 0.60426315 -1.14854927
O  2.42775988 1.40672919 -0.22704099
O  3.03436525 0.99450102 -2.30776788
C  2.38774581 0.47806151 1.71282554
H  1.84098096 1.16111653 2.37875255
H  -2.20819019 -0.71712378 -1.82044674
C  1.72955916 -1.29176017 0.03463764
C  2.88303692 -0.94961073 -0.89128946
H  0.67734026 -2.47638949 -1.40557041
C  2.74850884 -1.62915907 -2.26266628
H  2.75350022 -2.723029 -2.14030286
H  3.59694191 -1.33882987 -2.89305136
H  1.82846467 -1.314031 -2.77520723
C  4.24711137 -1.37192237 -0.34789613
C  5.41862785 -0.82385496 -0.89318581
C  4.36938296 -2.33070383 0.66177944
C  6.67020148 -1.18517209 -0.39719011
H  5.33317645 -0.08674646 -1.69773081
C  5.62725688 -2.69664319 1.14766672
H  3.47096526 -2.7773783 1.0952699
C  6.79838865 -2.11942431 0.64321264
H  7.5700472 -0.73283223 -0.82427479
H  5.69635403 -3.44256497 1.94529781
Na 1.10325278 2.23710186 -2.12343953
C  -1.8523851 -1.93946047 2.5278315
H  -2.7968398 -1.98235182 1.96341585
H  -1.95689627 -1.19678433 3.33027661
H  -1.67849863 -2.92447708 2.98998017
C  8.14338133 -2.45226389 1.23058597
H  8.1640304 -3.47379036 1.63638707
H  8.38716001 -1.76791745 2.06158959
H  8.94587049 -2.35895289 0.48509443
C  3.86156026 0.6820506 1.8612742
H  4.0616475 1.75356694 2.02092656
H  4.46111659 0.39663978 0.99192573
C  5.88547094 0.13545565 3.33831079
H  5.98194474 1.1728145 3.70703794
H  6.42522476 0.11522362 2.37584106
C  4.41488921 -0.09120553 3.05257402
O  3.73099423 -0.83403488 3.72201002
C  6.44787381 -0.86423685 4.33255996
H  7.50033219 -0.64836707 4.5645879
H  6.38265656 -1.88529552 3.9274217
H  5.86940499 -0.85024692 5.26627538
O  -3.96781314 -1.99092428 -0.97599879
C  -5.03076638 -2.84911061 -0.50440475
C  -5.7739331 -2.1868226 0.65313772
C  -5.97162918 -3.20599387 -1.6512028
C  -4.29318266 -4.09256123 -0.02258245
H  -6.35832295 -1.32791232 0.3009393
H  -5.05485559 -1.83989354 1.41280096
H  -6.45103866 -2.91600125 1.12298729
H  -6.71121345 -3.94317894 -1.30466725
H  -5.40244278 -3.65166155 -2.4809094
H  -6.49850283 -2.31498064 -2.01395356
H  -3.60655757 -3.8417969 0.80003391
H  -3.70745991 -4.52815803 -0.84548564
H  -5.00980088 -4.84474588 0.33755177
N  -3.08088438 -0.19728982 -1.92760274
C  -2.93753653 1.18726849 -2.31769173
C  -1.43909365 1.53268515 -2.31964975
H  -3.30549031 1.36016096 -3.34390286
C  -3.67255403 2.17643974 -1.38416687
O  -0.62743832 0.64185335 -1.90474556
O  -1.10195739 2.68014037 -2.66919164
H  -4.75447271 2.06468982 -1.52550843
H  -3.36953309 3.1820791 -1.71375717
C  -3.31551307 1.95522472 0.06106229
C  -4.20971204 1.3948943 0.97137032
C  -2.00782989 2.26922574 0.51877994
C  -3.84996549 1.16128962 2.31120624
H  -5.21470634 1.13560071 0.62839879
C  -1.62305923 1.98944581 1.83936937
H  -1.33758329 2.8365024 -0.13342852
C  -2.56132751 1.44577819 2.74442696
H  -4.5778404 0.73612711 3.00973275
H  -0.64615101 2.2955035 2.22077044
O  -2.12822002 1.21353803 4.01103729
H  -2.85856979 0.89214885 4.55828858
