program: Gaussian 16
title: Title Card Required
version: ES64L-G16RevC.01
method: RB3LYP
basis: 6-31+G(d,p)
operation: Freq
keyword: #N
keyword: Geom=AllCheck
keyword: Guess=TCheck
keyword: SCRF=Check
keyword: GenChk
keyword: RB3LYP/6-31+G(d,p)
keyword: Freq
converged: YES YES YES YES
title: Mulliken charges:
elementType: C C C C C C H H H H H H H C H H H C H H H C H C C H H C H H C H H C H H H C C H H C H H C H H H C H C H H
charge: -0.235958 -0.232429 -0.125323 -0.105956 -0.065095 -0.208702 0.160400 0.141503 0.123794 0.161723 0.151976 0.153165 0.154276 -0.446293 0.171456 0.146250 0.131572 -0.303455 0.143696 0.168609 0.158705 -0.082948 0.183957 -0.469193 -0.369859 0.242227 0.190362 -0.447341 0.166789 0.176751 -0.366920 0.188318 0.190681 -0.083068 0.170296 0.157771 0.172156 0.112886 0.059401 0.207987 0.176985 -0.469781 0.178323 0.161604 -0.184639 0.175939 0.181327 0.163046 -0.225090 0.149127 -0.239473 0.165121 0.123341
chargesum: 1.00000
title: Mulliken charges with hydrogens summed into heavy atoms:
elementType: C C C C C C C C C C C C C C C C C C C C
charge: 0.049559 0.069475 -0.125323 0.046021 -0.065095 0.098739 0.002985 0.167555 0.101009 -0.469193 0.062730 -0.103800 0.012079 0.417155 0.112886 0.444374 -0.129853 0.335673 -0.075963 0.048989
1716.lowfreq: -2.7119 -0.0003 0.0003 0.0005 5.6977 11.3251 41.6320 54.7900 84.7795
frequency: 41.6157 54.7856 84.7772 107.8230 116.0649 121.3565 191.6078 214.0887 227.6317 244.2268 252.2561 262.5629 272.7689 280.7686 282.9095 290.8801 299.8047 306.8691 313.9342 327.9939 338.9870 358.2721 372.8743 399.3568 408.9314 419.8031 447.0900 457.6210 482.0823 496.6334 519.8428 523.8959 546.4795 583.2416 626.3166 641.1470 684.5404 698.6426 725.4829 750.2352 807.8065 810.9976 828.6970 835.4676 864.6696 870.4116 883.7052 913.6942 919.1241 932.6757 934.4356 943.8885 954.6192 965.8951 971.1486 975.8755 992.0419 999.3884 1012.3179 1021.4147 1029.7251 1047.1410 1053.2475 1057.5747 1075.4127 1077.4134 1086.6868 1097.0335 1111.9972 1123.1757 1123.5931 1137.8339 1167.3526 1177.9423 1195.7324 1210.7413 1217.5381 1227.5531 1244.6242 1246.4666 1257.2375 1262.9883 1280.0424 1294.0732 1301.2273 1308.6767 1321.1976 1335.5484 1341.5947 1354.8430 1366.1129 1371.2929 1374.9748 1379.6923 1387.1279 1397.0845 1399.6370 1411.5580 1421.4636 1424.7119 1437.3047 1439.5271 1453.5607 1459.2433 1485.3382 1487.7537 1491.1008 1492.9102 1496.6242 1498.7060 1500.3754 1502.2199 1509.0172 1509.8078 1512.9873 1516.1564 1518.6034 1522.2342 1528.3689 1709.8405 2924.1015 3020.5464 3030.6898 3034.2984 3036.8681 3042.6081 3045.1499 3047.3850 3049.1914 3050.8053 3055.2576 3064.0993 3072.4045 3078.8060 3082.5101 3086.8025 3094.1398 3097.1770 3100.5287 3110.0920 3114.0801 3117.0940 3121.6458 3123.6606 3128.5639 3130.6896 3135.6077 3138.7767 3139.1051 3145.4465 3147.6321 3164.9026 3247.1191
redmass: 3.3969 2.9752 2.8741 2.6821 2.5772 2.6605 2.6065 2.4418 2.6135 1.2650 1.7683 1.0686 1.7100 2.0252 2.2591 1.7353 1.6832 2.1654 1.8314 2.1552 2.2610 2.4112 2.0980 2.1292 2.1946 2.5700 2.1746 3.4863 2.6691 2.6573 2.6264 2.5014 2.7093 1.9913 3.3840 2.5126 3.2525 2.0916 2.5263 2.2056 2.2271 2.4279 2.3884 1.7412 1.8909 1.8623 2.3425 2.2690 2.0962 1.6943 2.1616 1.5767 1.8345 1.4242 1.6985 1.9065 1.5696 1.7170 1.4478 1.6624 1.2060 1.9760 1.5038 1.7157 2.0875 1.6252 1.8083 2.3062 1.9639 1.5608 1.4367 1.6701 1.8888 1.8126 2.1168 2.1168 2.1265 1.5801 2.1899 1.7383 1.3449 1.2623 1.6163 1.3719 1.6338 1.7134 1.3518 1.3704 1.2350 1.4240 1.3806 1.3824 1.4030 1.4122 1.5521 1.3803 1.1596 1.2597 1.2705 1.6671 1.2190 1.3634 2.0105 1.2015 1.0867 1.0860 1.0770 1.0567 1.0589 1.0763 1.0704 1.0894 1.0850 1.0616 1.1000 1.1053 1.0707 1.0646 1.0585 4.4983 1.0702 1.0708 1.0626 1.0611 1.0425 1.0578 1.0454 1.0620 1.0546 1.0677 1.0409 1.0697 1.1016 1.0989 1.0692 1.0948 1.0934 1.0653 1.0938 1.0869 1.1007 1.1022 1.1006 1.1026 1.0971 1.1020 1.1030 1.1037 1.1057 1.0964 1.0880 1.0653 1.1153
irintensity: 0.7825 1.2615 0.2326 2.1015 0.4177 1.1103 0.5224 0.5645 0.1071 0.0408 1.4922 0.1187 0.5099 0.1166 0.3947 0.8391 0.2054 0.9000 1.5829 0.1398 1.2961 0.8556 0.6478 1.0498 1.3822 1.0123 1.9618 0.8175 0.3683 2.1706 0.1349 1.2555 1.8900 0.2683 1.3756 27.9591 1.4989 10.0148 2.5468 15.8283 3.4373 3.8380 1.6010 13.2454 14.4344 4.4515 2.0455 13.0559 8.0175 15.9662 6.8070 0.7122 1.0082 29.3179 32.0806 6.6327 3.2181 2.3861 1.4760 8.9328 22.6579 2.5840 10.1738 6.6395 2.0166 6.7821 0.8257 4.6055 34.9734 4.1962 8.6572 5.1164 12.6257 49.3759 6.5306 3.2727 5.9261 10.2618 6.0426 10.4807 5.4186 12.5857 22.0892 10.8932 0.9335 3.1164 19.4430 0.9225 4.1448 17.1650 0.4240 3.2383 0.5243 1.1585 0.4099 4.6950 28.6037 11.0176 7.2087 16.1653 19.6184 1.2066 16.0087 12.9152 3.8956 1.4031 1.0164 0.7816 5.0445 9.6113 22.3281 22.0343 13.1623 8.4590 10.3679 4.0271 13.0336 3.3350 22.5745 5.8549 27.2264 9.7636 26.8848 20.3848 41.9772 13.8483 3.3265 16.9990 23.7770 10.6449 19.0738 5.5816 26.2300 24.8286 4.9235 34.7043 8.5521 13.6704 15.7918 6.6889 25.6675 21.5584 35.1890 12.3137 27.9660 23.0753 5.5002 6.0805 8.5782 7.4099 7.1361 4.1682 5.2736
temp: 298.150 k
press: 1.00000 atm
elementType: 6 6 6 6 6 6 1 1 1 1 1 1 1 6 1 1 1 6 1 1 1 6 1 6 6 1 1 6 1 1 6 1 1 6 1 1 1 6 6 1 1 6 1 1 6 1 1 1 6 1 6 1 1
symmnumber: 1
zpe: 1285769.1 jmol-1
zpe.correction: 0.489724 hartree
zpe.thermalcorrener: 0.509793 hartree
zpe.thermalcorrenthalpy: 0.510737 hartree
zpe.thermalcorrgfe: 0.444264 hartree
zpe.sumelectzpe: -781.418590 hartree
zpe.sumelectthermal: -781.398521 hartree
zpe.sumelectthermalent: -781.397577 hartree
zpe.sumelectthermalfe: -781.464050 hartree
dipole: -3.1137 -0.6191 0.1103
dipole: 3.1766
quadrupole: -95.4434 -111.3825 -115.2274
quadrupole: -0.3098 1.0943 -1.3671
quadrupole: 11.9077 -4.0314 -7.8763 -0.3098 1.0943 -1.3671
hfenergy: -781.9083136 hartree
pointgroup: C01 [X(C20H33)]
dipole: -1.2176142 -0.2787458 0.0402541 debye
polarizability: 244.5258397|-1.519055|206.8798108|2.0143008|-5.5769986|193.2241573 unknown
InChI: InChI=1/C20H33/c1-6-19(4)13-10-16-15(14-19)8-9-17-18(2,3)11-7-12-20(16,17)5/h6,16-17H,1,7-14H2,2-5H3
charge 1 multiplicity 1
53 atoms
C  2.54409863 1.9332467 -0.94139538
C  1.89306288 2.10625832 0.43252213
C  1.10321513 0.86719902 0.90924379
C  1.98764454 -0.41436885 0.77915755
C  2.73389539 -0.61563175 -0.58428762
C  3.45079936 0.70260656 -0.95834925
H  2.67943529 2.3035269 1.17151686
H  1.2401245 2.9878577 0.44545472
H  1.78380848 1.86113248 -1.73111413
H  3.12724232 2.82792438 -1.18188334
H  2.79430505 -0.26903471 1.50727608
H  4.26911944 0.86465579 -0.2440386
H  3.92023347 0.58573864 -1.94177417
C  1.82943029 -1.07296836 -1.74817918
H  2.44927461 -1.36750235 -2.60049669
H  1.23181714 -1.95429231 -1.48473163
H  1.15883181 -0.29116946 -2.11179029
C  3.82241197 -1.69354227 -0.39617529
H  3.40601308 -2.69447767 -0.2473043
H  4.45800759 -1.7402673 -1.28596748
H  4.46507114 -1.4631306 0.45975146
C  -0.17490757 0.72304521 0.0370438
H  0.02437096 1.07789804 -0.98052152
C  -0.72758742 -0.62753924 -0.09035417
C  -0.2956793 -1.67537899 0.82612372
H  -0.92783834 -1.43313148 1.7075125
H  -0.64078953 -2.65929044 0.50006112
C  1.19989027 -1.65614307 1.24691302
H  1.65357658 -2.56402004 0.84634792
H  1.25292599 -1.74519535 2.33319398
C  -1.40660963 1.62138555 0.48491862
H  -1.02504913 2.64257813 0.55542571
H  -1.73746078 1.32160435 1.48206177
C  0.74994 1.07362202 2.39825224
H  0.28598267 2.04898625 2.56545472
H  0.07189867 0.31381416 2.7982692
H  1.66377618 1.04359207 2.99780404
C  -3.07053006 0.0782636 -0.6663646
C  -1.8259778 -0.83563781 -1.04464288
H  -1.49910309 -0.49397618 -2.03382625
H  -2.12032896 -1.88295102 -1.11662679
C  -2.5509743 1.52032883 -0.51475748
H  -3.37782412 2.15868572 -0.18347033
H  -2.23369033 1.89971609 -1.4933361
C  -4.09118397 -0.01879132 -1.81591571
H  -4.40859048 -1.05328898 -1.97016
H  -4.9813634 0.56910168 -1.57341755
H  -3.66873325 0.36768004 -2.74929428
C  -3.73381591 -0.37387243 0.6220439
H  -4.32686082 0.40305125 1.10479841
C  -3.73013805 -1.59377873 1.16310355
H  -4.29943566 -1.80527009 2.0621417
H  -3.19718652 -2.43426867 0.72798352
