program: Gaussian 16
title: Title Card Required
version: ES64L-G16RevC.01
method: RB3LYP
basis: 6-31+G(d,p)
operation: Freq
keyword: #N
keyword: Geom=AllCheck
keyword: Guess=TCheck
keyword: SCRF=Check
keyword: GenChk
keyword: RB3LYP/6-31+G(d,p)
keyword: Freq
converged: YES YES NO YES
title: Mulliken charges:
elementType: C C C C C C H H H H H H H C H H H C H H H C H C C H H C H H C H H C H H H C C H H C H H C H H H C H C H H
charge: -0.235093 -0.239763 -0.169828 -0.081952 -0.076573 -0.202831 0.160256 0.144269 0.123903 0.161387 0.151596 0.152425 0.154188 -0.454719 0.133232 0.171773 0.147598 -0.303099 0.143590 0.168360 0.158590 -0.122608 0.181629 -0.393939 -0.284412 0.236031 0.186170 -0.416150 0.166964 0.176157 -0.363717 0.191403 0.188324 -0.083215 0.169241 0.158955 0.171742 -0.244387 0.003849 0.200915 0.184249 -0.410579 0.180753 0.164243 -0.151463 0.174557 0.188059 0.163857 0.011613 0.135467 -0.272041 0.161671 0.139350
chargesum: 1.00000
title: Mulliken charges with hydrogens summed into heavy atoms:
elementType: C C C C C C C C C C C C C C C C C C C C
charge: 0.050197 0.064762 -0.169828 0.069644 -0.076573 0.103783 -0.002115 0.167441 0.059021 -0.393939 0.137789 -0.073029 0.016009 0.416724 -0.244387 0.389013 -0.065582 0.375009 0.147080 0.028980
1716.lowfreq: -5.6791 -2.7362 0.0005 0.0005 0.0007 9.5392 50.7649 59.6110 84.9462
frequency: 50.7069 59.6071 84.9401 108.0433 113.8088 130.5737 192.5326 220.2016 233.9899 245.3074 257.7672 261.8137 278.6152 283.3760 291.7670 297.0723 305.4394 306.6157 320.6746 330.5096 339.6948 356.7939 370.2219 394.5338 410.6700 413.4072 436.1008 459.3386 476.6144 493.4636 517.6770 534.1518 563.8477 587.4139 623.3705 658.8828 677.9516 701.3111 723.4966 750.5800 804.6517 820.5149 827.5932 829.4791 836.2479 868.2280 882.7944 911.9893 917.5490 929.7924 934.7190 943.9866 953.5486 968.6525 975.0734 978.2718 992.0690 1002.5679 1011.9444 1023.8722 1037.6832 1044.7252 1052.2728 1056.2974 1070.2454 1075.4983 1080.6150 1089.6127 1096.7485 1124.7214 1129.7449 1151.7452 1160.1322 1171.3373 1197.9363 1208.0928 1222.4741 1228.8619 1245.1969 1249.2107 1258.2329 1266.5993 1273.0742 1292.5946 1305.9406 1309.6270 1324.5138 1335.6396 1341.9365 1358.2231 1365.9132 1370.1826 1375.6056 1384.0984 1387.6183 1397.3179 1411.3209 1416.3002 1421.3901 1426.0124 1437.5173 1440.2755 1459.0932 1461.4641 1485.3804 1489.1228 1492.3762 1493.4001 1496.7403 1500.3165 1501.8387 1503.0660 1508.9179 1510.1082 1515.1611 1518.3711 1519.3073 1523.6802 1528.8279 1709.0760 2933.8288 3023.5140 3031.1091 3031.6348 3036.1835 3043.3195 3047.9309 3047.9816 3054.4585 3056.1195 3067.0849 3070.8768 3078.3202 3080.1991 3087.3464 3091.0903 3097.4101 3097.9288 3099.5727 3115.1083 3117.1332 3118.1649 3123.3017 3126.9530 3129.6972 3131.2578 3134.0516 3139.8363 3142.1617 3150.2635 3161.5255 3168.4186 3250.9945
redmass: 3.3443 3.5202 3.0556 3.1208 2.2933 2.4672 2.6760 2.5122 2.3743 1.2842 1.6116 1.2314 2.0313 1.9498 2.2804 1.9730 1.6496 1.9803 1.5042 2.1584 2.1060 2.0752 2.3667 2.1351 2.4118 2.5093 2.3762 3.3963 2.6793 2.7322 2.1915 2.8086 2.7459 2.0361 3.4927 2.4897 2.7795 2.2353 2.4751 2.1566 2.2029 3.1413 2.6245 2.0974 1.9082 1.5355 2.3062 2.3718 2.1489 2.0980 1.7106 1.5483 2.0141 1.8578 1.5972 1.3611 1.5592 1.6947 1.4414 1.9676 1.1568 1.8892 1.4150 1.7618 1.7925 2.0519 1.8790 2.2299 1.9218 1.7602 1.3251 1.3879 1.8608 1.8304 2.2441 1.9256 2.1288 1.5148 2.1689 1.4224 1.3610 1.4107 1.4253 1.3671 1.7022 1.8317 1.4055 1.3831 1.2948 1.3603 1.4028 1.3524 1.4056 1.4016 1.5308 1.3927 1.2720 1.1273 1.2068 1.8889 1.2113 1.3637 1.3805 1.5247 1.0900 1.0829 1.0747 1.0622 1.0578 1.0700 1.0757 1.1117 1.0869 1.0597 1.0855 1.1647 1.0675 1.0664 1.0609 4.4751 1.0700 1.0693 1.0632 1.0614 1.0434 1.0569 1.0585 1.0417 1.0594 1.0387 1.0774 1.1010 1.0984 1.0637 1.0956 1.0728 1.0924 1.0896 1.0690 1.1000 1.1018 1.0894 1.1007 1.1034 1.0968 1.1018 1.1025 1.0879 1.1038 1.1058 1.0989 1.0650 1.1163
irintensity: 0.5839 1.3003 0.2168 1.1248 0.9822 1.0489 0.0941 1.2285 0.0553 0.0275 1.6635 1.0568 0.1873 0.4567 1.5343 0.4989 0.1608 0.6830 0.7233 0.7075 1.0906 0.3556 2.2359 1.2800 0.6537 1.1179 3.5150 0.5202 1.1018 0.6530 0.5013 1.2062 1.6588 0.4940 0.8900 31.8795 0.2867 8.5293 4.5110 25.5530 8.1135 19.9475 29.5110 11.7964 2.2214 3.5519 2.2790 10.0917 4.5394 0.5054 18.4167 1.1026 4.5621 22.6777 7.0992 28.4963 4.8400 3.2428 1.6446 14.5143 24.7314 2.8257 2.1762 4.6382 36.5497 3.0213 33.8311 21.6952 8.8930 4.1883 4.1349 10.7030 47.8920 1.9357 7.0648 2.2240 6.6926 8.7719 1.7466 20.7313 6.7719 21.2589 10.8788 6.3567 4.8401 3.0834 18.8138 2.5913 5.0356 11.6454 1.5813 1.9357 0.5182 0.8980 1.0662 3.6162 9.5054 25.9694 3.3396 24.0918 21.4106 0.7053 11.8706 12.1540 5.7284 1.2391 2.4560 0.8646 6.5238 9.7875 21.5642 23.2212 12.6306 8.1909 7.8855 11.3219 12.6530 1.6057 24.7218 4.3882 20.9654 8.2622 23.0650 22.9374 49.9944 12.2339 17.7184 4.3228 13.9289 18.7317 7.4001 25.9524 23.6368 4.3348 36.7625 3.5225 1.5053 23.5716 10.9164 31.0523 19.1279 3.1919 36.4918 12.3028 24.2603 26.3254 4.3674 6.0404 6.7785 9.7579 5.7163 1.3658 3.6270
temp: 298.150 k
press: 1.00000 atm
elementType: 6 6 6 6 6 6 1 1 1 1 1 1 1 6 1 1 1 6 1 1 1 6 1 6 6 1 1 6 1 1 6 1 1 6 1 1 1 6 6 1 1 6 1 1 6 1 1 1 6 1 6 1 1
symmnumber: 1
zpe: 1287005.6 jmol-1
zpe.correction: 0.490195 hartree
zpe.thermalcorrener: 0.510156 hartree
zpe.thermalcorrenthalpy: 0.511100 hartree
zpe.thermalcorrgfe: 0.445102 hartree
zpe.sumelectzpe: -781.418655 hartree
zpe.sumelectthermal: -781.398693 hartree
zpe.sumelectthermalent: -781.397749 hartree
zpe.sumelectthermalfe: -781.463747 hartree
dipole: -3.2559 -0.7388 0.2915
dipole: 3.3514
quadrupole: -95.2046 -112.4343 -113.6517
quadrupole: 1.4130 0.9063 -0.8955
quadrupole: 11.8922 -5.3374 -6.5548 1.4130 0.9063 -0.8955
hfenergy: -781.9088491 hartree
pointgroup: C01 [X(C20H33)]
dipole: -1.2786458 -0.3157484 0.0624708 debye
polarizability: 249.9194911|-3.4720728|199.5958108|-2.6816722|3.5302558|199.4856761 unknown
InChI: InChI=1/C20H33/c1-6-19(4)13-10-16-15(14-19)8-9-17-18(2,3)11-7-12-20(16,17)5/h6,16-17H,1,7-14H2,2-5H3
charge 1 multiplicity 1
53 atoms
C  2.54700932 1.77191722 -1.24667173
C  1.90335562 2.12257728 0.09654387
C  1.12357384 0.95542521 0.74109071
C  2.00093146 -0.33833772 0.76609064
C  2.73475596 -0.71023999 -0.56745854
C  3.45297634 0.54858341 -1.10730982
H  2.69328712 2.42283447 0.79600616
H  1.24190482 2.99275784 -0.00338871
H  1.78312967 1.59767459 -2.01621967
H  3.12943785 2.62725087 -1.60373572
H  2.81416593 -0.10805689 1.46439515
H  4.27299441 0.79884949 -0.42087987
H  3.92018876 0.30632309 -2.06865937
C  1.81660991 -1.30005263 -1.65803592
H  1.13761726 -0.56608815 -2.097468
H  2.42543948 -1.68767972 -2.48078849
H  1.22820811 -2.14866565 -1.28762717
C  3.82016961 -1.76255427 -0.25791013
H  3.40092969 -2.73479328 0.01844614
H  4.44617518 -1.92315313 -1.14123212
H  4.47287551 -1.43137075 0.55635193
C  -0.16743249 0.70141124 -0.09481677
H  -0.01210464 0.99654381 -1.13719713
C  -0.68233066 -0.66784416 -0.08726517
C  -0.29459576 -1.56876565 0.99270438
H  -0.90796822 -1.18048559 1.83244819
H  -0.65173195 -2.58570451 0.81859355
C  1.21175458 -1.50919051 1.39176291
H  1.65461637 -2.46180824 1.09782993
H  1.27541663 -1.46567789 2.48004504
C  -1.43203414 1.56367826 0.3511624
H  -1.1130759 2.60691113 0.28488977
H  -1.6577536 1.35312355 1.39580577
C  0.803931 1.35298387 2.19881773
H  0.33376372 2.33824046 2.25058127
H  0.14883894 0.64560684 2.7154932
H  1.73484073 1.4100198 2.76932341
C  -3.05696302 -0.17654924 -0.60215184
C  -1.7424283 -1.00336785 -1.03358987
H  -1.48794443 -0.65720376 -2.03926786
H  -1.97258804 -2.06965136 -1.05196661
C  -2.64711756 1.30267332 -0.53351976
H  -3.49331987 1.89293355 -0.16581117
H  -2.44791428 1.65611255 -1.55179215
C  -4.10333951 -0.41351025 -1.70787179
H  -4.36479334 -1.47237448 -1.78923574
H  -5.01605465 0.13807559 -1.46588763
H  -3.73374752 -0.07023866 -2.67920417
C  -3.58798349 -0.75670349 0.69212943
H  -3.71610654 -1.83954798 0.6733467
C  -3.97136407 -0.09227214 1.78436033
H  -4.40020216 -0.6188133 2.63066531
H  -3.90623967 0.98764375 1.87415302
